Ticket #73106: main.log

File main.log, 44.0 KB (added by thetrial (alabay), 11 months ago)
Line 
1version:1
2:debug:main Starting logging for ccache @4.12.1_1+doc
3:debug:sysinfo macOS 10.12.6 (darwin/16.7.0) arch i386
4:debug:sysinfo MacPorts 2.11.5
5:debug:sysinfo Xcode 9.2, CLT 9.2.0.0.1.1510905681
6:debug:sysinfo SDK 10.12
7:debug:sysinfo MACOSX_DEPLOYMENT_TARGET: 10.12
8:msg:main --->  Computing dependencies for ccache:info:main .:debug:main Searching for dependency: xz
9:debug:main Found Dependency: receipt exists for xz
10:debug:main Searching for dependency: cmake
11:debug:main Found Dependency: receipt exists for cmake
12:debug:main Searching for dependency: doctest
13:debug:main Found Dependency: receipt exists for doctest
14:debug:main Searching for dependency: perl5
15:debug:main Found Dependency: receipt exists for perl5
16:debug:main Searching for dependency: pkgconfig
17:debug:main Found Dependency: receipt exists for pkgconfig
18:debug:main Searching for dependency: asciidoctor
19:debug:main Found Dependency: receipt exists for asciidoctor
20:debug:main Searching for dependency: clang-16
21:debug:main Found Dependency: receipt exists for clang-16
22:debug:main Searching for dependency: hiredis
23:debug:main Found Dependency: receipt exists for hiredis
24:debug:main Searching for dependency: xxhashlib
25:debug:main Found Dependency: receipt exists for xxhashlib
26:debug:main Searching for dependency: zstd
27:debug:main Found Dependency: receipt exists for zstd
28:debug:main Searching for dependency: legacy-support
29:debug:main Found Dependency: receipt exists for legacy-support
30:debug:main Searching for dependency: macports-libcxx
31:debug:main Found Dependency: receipt exists for macports-libcxx
32:debug:main Executing org.macports.main (ccache)
33:debug:main dropping privileges: euid changed to 504, egid changed to 501.
34:debug:main Privilege de-escalation not attempted as not running as root.
35:debug:archivefetch archivefetch phase started at Thu Oct  9 10:23:47 CEST 2025
36:msg:archivefetch --->  Fetching archive for ccache
37:debug:archivefetch Executing org.macports.archivefetch (ccache)
38:debug:archivefetch euid/egid changed to: 0/0
39:debug:archivefetch chowned /opt/local/var/macports/incoming to macports
40:debug:archivefetch euid/egid changed to: 504/501
41:info:archivefetch --->  ccache-4.12.1_1+doc.darwin_16.x86_64.tbz2 doesn't seem to exist in /opt/local/var/macports/incoming/verified
42:msg:archivefetch --->  Attempting to fetch ccache-4.12.1_1+doc.darwin_16.x86_64.tbz2 from https://packages.macports.org/ccache
43:debug:archivefetch Fetching archive failed: The requested URL returned error: 404 Not Found
44:msg:archivefetch --->  Attempting to fetch ccache-4.12.1_1+doc.darwin_16.x86_64.tbz2 from https://fra.de.packages.macports.org/ccache
45:debug:archivefetch Fetching archive failed: The requested URL returned error: 404 Not Found
46:msg:archivefetch --->  Attempting to fetch ccache-4.12.1_1+doc.darwin_16.x86_64.tbz2 from https://vie.at.packages.macports.org/ccache
47:debug:archivefetch Fetching archive failed: The requested URL returned error: 404 Not Found
48:debug:archivefetch Privilege de-escalation not attempted as not running as root.
49:debug:fetch fetch phase started at Thu Oct  9 10:23:49 CEST 2025
50:notice:fetch --->  Fetching distfiles for ccache
51:debug:fetch Executing org.macports.fetch (ccache)
52:debug:fetch Privilege de-escalation not attempted as not running as root.
53:debug:checksum checksum phase started at Thu Oct  9 10:23:49 CEST 2025
54:notice:checksum --->  Verifying checksums for ccache
55:debug:checksum Executing org.macports.checksum (ccache)
56:info:checksum --->  Checksumming ccache-4.12.1.tar.xz
57:debug:checksum Calculated (rmd160) is d5e290213073685c303ec656b014a191474d0691
58:debug:checksum Correct (rmd160) checksum for ccache-4.12.1.tar.xz
59:debug:checksum Calculated (sha256) is 42e6c4b260cffd92dfa755e26390f45f5842e8c1a5f64f2b2e68adfbe82d1542
60:debug:checksum Correct (sha256) checksum for ccache-4.12.1.tar.xz
61:debug:checksum Calculated (size) is 509872
62:debug:checksum Correct (size) checksum for ccache-4.12.1.tar.xz
63:debug:checksum Privilege de-escalation not attempted as not running as root.
64:debug:extract extract phase started at Thu Oct  9 10:23:49 CEST 2025
65:notice:extract --->  Extracting ccache
66:debug:extract setting option extract.cmd to /opt/local/bin/xz
67:debug:extract Executing org.macports.extract (ccache)
68:info:extract --->  Extracting ccache-4.12.1.tar.xz
69:debug:extract setting option extract.args to '/opt/local/var/macports/distfiles/ccache/ccache-4.12.1.tar.xz'
70:debug:extract Environment:
71:debug:extract CC_PRINT_OPTIONS='YES'
72:debug:extract CC_PRINT_OPTIONS_FILE='/opt/local/var/macports/build/ccache-71117637/work/.CC_PRINT_OPTIONS'
73:debug:extract CPATH='/opt/local/include'
74:debug:extract CPLUS_INCLUDE_PATH='/opt/local/include/LegacySupport:/opt/local/include/libcxx/v1'
75:debug:extract C_INCLUDE_PATH='/opt/local/include/LegacySupport:/opt/local/include/libcxx/v1'
76:debug:extract DEVELOPER_DIR='/Library/Developer/CommandLineTools'
77:debug:extract LIBRARY_PATH='/opt/local/lib'
78:debug:extract MACOSX_DEPLOYMENT_TARGET='10.12'
79:debug:extract MACPORTS_LEGACY_SUPPORT_CPPFLAGS='-isystem/opt/local/include/LegacySupport -nostdinc++ -isystem/opt/local/include/libcxx/v1'
80:debug:extract MACPORTS_LEGACY_SUPPORT_ENABLED='1'
81:debug:extract MACPORTS_LEGACY_SUPPORT_LDFLAGS='-L/opt/local/lib -lMacportsLegacySupport -L/opt/local/lib/libcxx'
82:debug:extract OBJCPLUS_INCLUDE_PATH='/opt/local/include/LegacySupport:/opt/local/include/libcxx/v1'
83:debug:extract OBJC_INCLUDE_PATH='/opt/local/include/LegacySupport:/opt/local/include/libcxx/v1'
84:debug:extract SOURCE_DATE_EPOCH='1759894490'
85:info:extract Executing:  cd "/opt/local/var/macports/build/ccache-71117637/work" && /opt/local/bin/xz -dc '/opt/local/var/macports/distfiles/ccache/ccache-4.12.1.tar.xz' | /usr/bin/tar -xf -
86:debug:extract system:  cd "/opt/local/var/macports/build/ccache-71117637/work" && /opt/local/bin/xz -dc '/opt/local/var/macports/distfiles/ccache/ccache-4.12.1.tar.xz' | /usr/bin/tar -xf -
87:debug:extract euid/egid changed to: 0/0
88:debug:extract chowned /opt/local/var/macports/build/ccache-71117637/work to macports
89:debug:extract euid/egid changed to: 504/501
90:debug:extract Privilege de-escalation not attempted as not running as root.
91:debug:patch patch phase started at Thu Oct  9 10:23:49 CEST 2025
92:debug:patch Executing org.macports.patch (ccache)
93:debug:patch Privilege de-escalation not attempted as not running as root.
94:debug:configure configure phase started at Thu Oct  9 10:23:49 CEST 2025
95:notice:configure --->  Configuring ccache
96:debug:configure Preferred compilers: macports-clang-16 macports-clang-15 macports-clang-14 macports-clang-13 macports-clang-12 macports-clang-11 macports-clang-10 macports-clang-9.0 macports-clang-8.0 macports-clang-7.0 macports-clang-6.0 macports-clang-5.0
97:debug:configure Using compiler 'MacPorts Clang 16'
98:debug:configure elevating privileges for configure ccache: euid changed to 0, egid changed to 0.
99:debug:configure dropping privileges: euid changed to 504, egid changed to 501.
100:warn:configure ccache_dir /opt/local/var/macports/build/.ccache could not be initialized; disabling ccache: dyld: Library not loaded: /opt/local/lib/libhiredis.1.1.0.dylib
101:warn:configure   Referenced from: /opt/local/bin/ccache
102:warn:configure   Reason: image not found
103:debug:configure Executing proc-pre-org.macports.configure-configure-0
104:debug:configure CPPFLAGS="-isystem/opt/local/include/libcxx/v1 -nostdinc++ -isystem/opt/local/include/LegacySupport -I/opt/local/include" inserted into CFLAGS="-Os -DNDEBUG -isystem/opt/local/include/libcxx/v1 -nostdinc++ -isystem/opt/local/include/LegacySupport -I/opt/local/include" CXXFLAGS="-Os -DNDEBUG -isystem/opt/local/include/libcxx/v1 -nostdinc++ -isystem/opt/local/include/LegacySupport -I/opt/local/include -stdlib=libc++"
105:info:configure         (using ccache)
106:debug:configure Executing proc-pre-org.macports.configure-configure-1
107:debug:configure Executing org.macports.configure (ccache)
108:debug:configure Environment:
109:debug:configure CC='/opt/local/bin/clang-mp-16'
110:debug:configure CC_PRINT_OPTIONS='YES'
111:debug:configure CC_PRINT_OPTIONS_FILE='/opt/local/var/macports/build/ccache-71117637/work/.CC_PRINT_OPTIONS'
112:debug:configure CFLAGS='-pipe -Os -DNDEBUG -isystem/opt/local/include/libcxx/v1 -nostdinc++ -isystem/opt/local/include/LegacySupport -I/opt/local/include'
113:debug:configure CPATH='/opt/local/include'
114:debug:configure CPLUS_INCLUDE_PATH='/opt/local/include/LegacySupport:/opt/local/include/libcxx/v1'
115:debug:configure CXX='/opt/local/bin/clang++-mp-16'
116:debug:configure CXXFLAGS='-pipe -Os -DNDEBUG -isystem/opt/local/include/libcxx/v1 -nostdinc++ -isystem/opt/local/include/LegacySupport -I/opt/local/include -stdlib=libc++'
117:debug:configure C_INCLUDE_PATH='/opt/local/include/LegacySupport:/opt/local/include/libcxx/v1'
118:debug:configure DEVELOPER_DIR='/Library/Developer/CommandLineTools'
119:debug:configure F90FLAGS='-pipe -Os -m64'
120:debug:configure FCFLAGS='-pipe -Os -m64'
121:debug:configure FFLAGS='-pipe -Os -m64'
122:debug:configure INSTALL='/usr/bin/install -c'
123:debug:configure LDFLAGS='-Wl,-headerpad_max_install_names -L/opt/local/lib -lMacportsLegacySupport -L/opt/local/lib/libcxx'
124:debug:configure LIBRARY_PATH='/opt/local/lib'
125:debug:configure MACOSX_DEPLOYMENT_TARGET='10.12'
126:debug:configure MACPORTS_LEGACY_SUPPORT_CPPFLAGS='-isystem/opt/local/include/LegacySupport -nostdinc++ -isystem/opt/local/include/libcxx/v1'
127:debug:configure MACPORTS_LEGACY_SUPPORT_ENABLED='1'
128:debug:configure MACPORTS_LEGACY_SUPPORT_LDFLAGS='-L/opt/local/lib -lMacportsLegacySupport -L/opt/local/lib/libcxx'
129:debug:configure OBJC='/opt/local/bin/clang-mp-16'
130:debug:configure OBJCFLAGS='-pipe -Os -isystem/opt/local/include/libcxx/v1 -nostdinc++ -isystem/opt/local/include/LegacySupport -I/opt/local/include'
131:debug:configure OBJCPLUS_INCLUDE_PATH='/opt/local/include/LegacySupport:/opt/local/include/libcxx/v1'
132:debug:configure OBJCXX='/opt/local/bin/clang++-mp-16'
133:debug:configure OBJCXXFLAGS='-pipe -Os -DNDEBUG -isystem/opt/local/include/libcxx/v1 -nostdinc++ -isystem/opt/local/include/LegacySupport -I/opt/local/include -isystem/opt/local/include/libcxx/v1 -nostdinc++ -isystem/opt/local/include/LegacySupport -I/opt/local/include -stdlib=libc++'
134:debug:configure OBJC_INCLUDE_PATH='/opt/local/include/LegacySupport:/opt/local/include/libcxx/v1'
135:debug:configure SOURCE_DATE_EPOCH='1759894490'
136:info:configure Executing:  cd "/opt/local/var/macports/build/ccache-71117637/work/build" && /opt/local/bin/cmake -G "CodeBlocks - Unix Makefiles" -DCMAKE_BUILD_TYPE=MacPorts -DCMAKE_INSTALL_PREFIX="/opt/local" -DCMAKE_INSTALL_NAME_DIR="/opt/local/lib" -DCMAKE_SYSTEM_PREFIX_PATH="/opt/local;/usr" -DCMAKE_C_COMPILER_LAUNCHER=/opt/local/bin/ccache -DCMAKE_CXX_COMPILER_LAUNCHER=/opt/local/bin/ccache -DCMAKE_Fortran_COMPILER_LAUNCHER=/opt/local/bin/ccache -DCMAKE_OBJC_COMPILER_LAUNCHER=/opt/local/bin/ccache -DCMAKE_OBJCXX_COMPILER_LAUNCHER=/opt/local/bin/ccache -DCMAKE_ISPC_COMPILER_LAUNCHER=/opt/local/bin/ccache -DCMAKE_C_COMPILER="$CC" -DCMAKE_CXX_COMPILER="$CXX" -DCMAKE_OBJC_COMPILER="$CC" -DCMAKE_OBJCXX_COMPILER="$CXX" -DCMAKE_POLICY_DEFAULT_CMP0025=NEW -DCMAKE_POLICY_DEFAULT_CMP0060=NEW -DCMAKE_VERBOSE_MAKEFILE=ON -DCMAKE_COLOR_MAKEFILE=ON -DCMAKE_FIND_FRAMEWORK=LAST -DCMAKE_EXPORT_COMPILE_COMMANDS=ON -DCMAKE_MAKE_PROGRAM=/usr/bin/make -DCMAKE_MODULE_PATH="/opt/local/share/cmake/Modules" -DCMAKE_PREFIX_PATH="/opt/local/share/cmake/Modules" -DCMAKE_BUILD_WITH_INSTALL_RPATH:BOOL=ON -DCMAKE_INSTALL_RPATH="/opt/local/lib" -Wno-dev -DUSE_CCACHE=NO -DDEP_BLAKE3=BUNDLED -DDEP_CPPHTTPLIB=BUNDLED -DDEP_FMT=BUNDLED -DDEP_NONSTDSPAN=BUNDLED -DDEP_TLEXPECTED=BUNDLED -DDEPS=LOCAL -DENABLE_DOCUMENTATION=ON -DCMAKE_OSX_ARCHITECTURES="x86_64" -DCMAKE_OSX_DEPLOYMENT_TARGET="10.12" -DCMAKE_OSX_SYSROOT="/" /opt/local/var/macports/build/ccache-71117637/work/ccache-4.12.1
137:debug:configure system:  cd "/opt/local/var/macports/build/ccache-71117637/work/build" && /opt/local/bin/cmake -G "CodeBlocks - Unix Makefiles" -DCMAKE_BUILD_TYPE=MacPorts -DCMAKE_INSTALL_PREFIX="/opt/local" -DCMAKE_INSTALL_NAME_DIR="/opt/local/lib" -DCMAKE_SYSTEM_PREFIX_PATH="/opt/local;/usr" -DCMAKE_C_COMPILER_LAUNCHER=/opt/local/bin/ccache -DCMAKE_CXX_COMPILER_LAUNCHER=/opt/local/bin/ccache -DCMAKE_Fortran_COMPILER_LAUNCHER=/opt/local/bin/ccache -DCMAKE_OBJC_COMPILER_LAUNCHER=/opt/local/bin/ccache -DCMAKE_OBJCXX_COMPILER_LAUNCHER=/opt/local/bin/ccache -DCMAKE_ISPC_COMPILER_LAUNCHER=/opt/local/bin/ccache -DCMAKE_C_COMPILER="$CC" -DCMAKE_CXX_COMPILER="$CXX" -DCMAKE_OBJC_COMPILER="$CC" -DCMAKE_OBJCXX_COMPILER="$CXX" -DCMAKE_POLICY_DEFAULT_CMP0025=NEW -DCMAKE_POLICY_DEFAULT_CMP0060=NEW -DCMAKE_VERBOSE_MAKEFILE=ON -DCMAKE_COLOR_MAKEFILE=ON -DCMAKE_FIND_FRAMEWORK=LAST -DCMAKE_EXPORT_COMPILE_COMMANDS=ON -DCMAKE_MAKE_PROGRAM=/usr/bin/make -DCMAKE_MODULE_PATH="/opt/local/share/cmake/Modules" -DCMAKE_PREFIX_PATH="/opt/local/share/cmake/Modules" -DCMAKE_BUILD_WITH_INSTALL_RPATH:BOOL=ON -DCMAKE_INSTALL_RPATH="/opt/local/lib" -Wno-dev -DUSE_CCACHE=NO -DDEP_BLAKE3=BUNDLED -DDEP_CPPHTTPLIB=BUNDLED -DDEP_FMT=BUNDLED -DDEP_NONSTDSPAN=BUNDLED -DDEP_TLEXPECTED=BUNDLED -DDEPS=LOCAL -DENABLE_DOCUMENTATION=ON -DCMAKE_OSX_ARCHITECTURES="x86_64" -DCMAKE_OSX_DEPLOYMENT_TARGET="10.12" -DCMAKE_OSX_SYSROOT="/" /opt/local/var/macports/build/ccache-71117637/work/ccache-4.12.1
138:info:configure -- The C compiler identification is Clang 16.0.6
139:info:configure -- The CXX compiler identification is Clang 16.0.6
140:info:configure -- The ASM compiler identification is Clang with GNU-like command-line
141:info:configure -- Found assembler: /opt/local/bin/clang-mp-16
142:info:configure -- The ASM_MASM compiler identification is unknown
143:info:configure -- Found assembler: ml
144:info:configure -- Detecting C compiler ABI info
145:info:configure -- Detecting C compiler ABI info - done
146:info:configure -- Check for working C compiler: /opt/local/bin/clang-mp-16 - skipped
147:info:configure -- Detecting C compile features
148:info:configure -- Detecting C compile features - done
149:info:configure -- Detecting CXX compiler ABI info
150:info:configure -- Detecting CXX compiler ABI info - done
151:info:configure -- Check for working CXX compiler: /opt/local/bin/clang++-mp-16 - skipped
152:info:configure -- Detecting CXX compile features
153:info:configure -- Detecting CXX compile features - done
154:info:configure -- Ccache version: 4.12.1
155:info:configure -- Ccache dev mode: OFF
156:info:configure -- Performing Test std_atomic_without_libatomic
157:info:configure -- Performing Test std_atomic_without_libatomic - Success
158:info:configure -- Performing Test std_filesystem_without_libfs
159:info:configure -- Performing Test std_filesystem_without_libfs - Success
160:info:configure -- Looking for cpuid.h
161:info:configure -- Looking for cpuid.h - found
162:info:configure -- Looking for dirent.h
163:info:configure -- Looking for dirent.h - found
164:info:configure -- Looking for linux/fs.h
165:info:configure -- Looking for linux/fs.h - not found
166:info:configure -- Looking for pwd.h
167:info:configure -- Looking for pwd.h - found
168:info:configure -- Looking for spawn.h
169:info:configure -- Looking for spawn.h - found
170:info:configure -- Looking for sys/clonefile.h
171:info:configure -- Looking for sys/clonefile.h - found
172:info:configure -- Looking for sys/file.h
173:info:configure -- Looking for sys/file.h - found
174:info:configure -- Looking for sys/ioctl.h
175:info:configure -- Looking for sys/ioctl.h - found
176:info:configure -- Looking for sys/mman.h
177:info:configure -- Looking for sys/mman.h - found
178:info:configure -- Looking for sys/sendfile.h
179:info:configure -- Looking for sys/sendfile.h - not found
180:info:configure -- Looking for sys/utime.h
181:info:configure -- Looking for sys/utime.h - not found
182:info:configure -- Looking for sys/wait.h
183:info:configure -- Looking for sys/wait.h - found
184:info:configure -- Looking for syslog.h
185:info:configure -- Looking for syslog.h - found
186:info:configure -- Looking for unistd.h
187:info:configure -- Looking for unistd.h - found
188:info:configure -- Looking for utime.h
189:info:configure -- Looking for utime.h - found
190:info:configure -- Looking for getopt_long
191:info:configure -- Looking for getopt_long - found
192:info:configure -- Looking for getpwuid
193:info:configure -- Looking for getpwuid - found
194:info:configure -- Looking for localtime_r
195:info:configure -- Looking for localtime_r - found
196:info:configure -- Looking for posix_fallocate
197:info:configure -- Looking for posix_fallocate - not found
198:info:configure -- Looking for setenv
199:info:configure -- Looking for setenv - found
200:info:configure -- Looking for syslog
201:info:configure -- Looking for syslog - found
202:info:configure -- Looking for unsetenv
203:info:configure -- Looking for unsetenv - found
204:info:configure -- Looking for utimensat
205:info:configure -- Looking for utimensat - found
206:info:configure -- Looking for utimes
207:info:configure -- Looking for utimes - found
208:info:configure -- Performing Test HAVE_STRUCT_STAT_ST_ATIM
209:info:configure -- Performing Test HAVE_STRUCT_STAT_ST_ATIM - Failed
210:info:configure -- Performing Test HAVE_STRUCT_STAT_ST_ATIMENSEC
211:info:configure -- Performing Test HAVE_STRUCT_STAT_ST_ATIMENSEC - Failed
212:info:configure -- Performing Test HAVE_STRUCT_STAT_ST_ATIMESPEC
213:info:configure -- Performing Test HAVE_STRUCT_STAT_ST_ATIMESPEC - Success
214:info:configure -- Performing Test HAVE_STRUCT_STAT_ST_CTIM
215:info:configure -- Performing Test HAVE_STRUCT_STAT_ST_CTIM - Failed
216:info:configure -- Performing Test HAVE_STRUCT_STAT_ST_CTIMENSEC
217:info:configure -- Performing Test HAVE_STRUCT_STAT_ST_CTIMENSEC - Failed
218:info:configure -- Performing Test HAVE_STRUCT_STAT_ST_CTIMESPEC
219:info:configure -- Performing Test HAVE_STRUCT_STAT_ST_CTIMESPEC - Success
220:info:configure -- Performing Test HAVE_STRUCT_STAT_ST_MTIM
221:info:configure -- Performing Test HAVE_STRUCT_STAT_ST_MTIM - Failed
222:info:configure -- Performing Test HAVE_STRUCT_STAT_ST_MTIMENSEC
223:info:configure -- Performing Test HAVE_STRUCT_STAT_ST_MTIMENSEC - Failed
224:info:configure -- Performing Test HAVE_STRUCT_STAT_ST_MTIMESPEC
225:info:configure -- Performing Test HAVE_STRUCT_STAT_ST_MTIMESPEC - Success
226:info:configure -- Performing Test HAVE_STRUCT_STATFS_F_FSTYPENAME
227:info:configure -- Performing Test HAVE_STRUCT_STATFS_F_FSTYPENAME - Success
228:info:configure -- Performing Test HAVE_AVX2
229:info:configure -- Performing Test HAVE_AVX2 - Success
230:info:configure -- Using bundled Blake3 as requested
231:info:configure -- Using bundled CppHttplib as requested
232:info:configure -- Using bundled Fmt as requested
233:info:configure -- Using bundled NonstdSpan as requested
234:info:configure -- Using bundled TlExpected as requested
235:info:configure -- Using system Xxhash (/opt/local/lib/libxxhash.dylib)
236:info:configure -- Using system Zstd (/opt/local/lib/libzstd.dylib)
237:info:configure -- Using system doctest (/opt/local/include/doctest/doctest.h)
238:info:configure -- Using system Hiredis (/opt/local/lib/libhiredis.dylib)
239:info:configure -- Performing Test HAVE_ASM_SSE2
240:info:configure -- Performing Test HAVE_ASM_SSE2 - Success
241:info:configure -- Performing Test HAVE_ASM_SSE41
242:info:configure -- Performing Test HAVE_ASM_SSE41 - Success
243:info:configure -- Performing Test HAVE_ASM_AVX2
244:info:configure -- Performing Test HAVE_ASM_AVX2 - Success
245:info:configure -- Performing Test HAVE_ASM_AVX512
246:info:configure -- Performing Test HAVE_ASM_AVX512 - Success
247:info:configure -- Performing Test HAVE_NEON
248:info:configure -- Performing Test HAVE_NEON - Failed
249:info:configure -- Performing Test CMAKE_HAVE_LIBC_PTHREAD
250:info:configure -- Performing Test CMAKE_HAVE_LIBC_PTHREAD - Success
251:info:configure -- Found Threads: TRUE
252:info:configure --
253:info:configure -- Configuration summary:
254:info:configure --   Storage backends:
255:info:configure --     file  ON
256:info:configure --     http  ON
257:info:configure --     redis ON
258:info:configure --   Dependencies:
259:info:configure --     Blake3     1.8.2  BUNDLED
260:info:configure --     CppHttplib 0.20.0 BUNDLED
261:info:configure --     Doctest    2.4.11 SYSTEM (/opt/local/include/doctest/doctest.h)
262:info:configure --     Fmt        11.1.4 BUNDLED
263:info:configure --     Hiredis    1.3.0  SYSTEM (/opt/local/lib/libhiredis.dylib)
264:info:configure --     NonstdSpan 0.11.0 BUNDLED
265:info:configure --     TlExpected 1.1.0  BUNDLED
266:info:configure --     Xxhash     0.8.3  SYSTEM (/opt/local/lib/libxxhash.dylib)
267:info:configure --     Zstd       1.5.7  SYSTEM (/opt/local/lib/libzstd.dylib)
268:info:configure --
269:info:configure -- Configuring done (36.7s)
270:info:configure -- Generating done (1.0s)
271:info:configure CMake Warning:
272:info:configure   Manually-specified variables were not used by the project:
273:info:configure     CMAKE_OBJCXX_COMPILER
274:info:configure     CMAKE_OBJC_COMPILER
275:info:configure     CMAKE_POLICY_DEFAULT_CMP0025
276:info:configure     CMAKE_POLICY_DEFAULT_CMP0060
277:info:configure     USE_CCACHE
278:info:configure -- Build files have been written to: /opt/local/var/macports/build/ccache-71117637/work/build
279:debug:configure Executing proc-post-org.macports.configure-configure-0
280:debug:configure configure.ccache restored to yes
281:debug:configure Executing proc-post-org.macports.configure-configure-1
282:debug:configure Executing portconfigure::configure_finish
283:debug:configure Privilege de-escalation not attempted as not running as root.
284:debug:build build phase started at Thu Oct  9 10:24:27 CEST 2025
285:notice:build --->  Building ccache
286:debug:build Executing org.macports.build (ccache)
287:debug:build Environment:
288:debug:build CC_PRINT_OPTIONS='YES'
289:debug:build CC_PRINT_OPTIONS_FILE='/opt/local/var/macports/build/ccache-71117637/work/.CC_PRINT_OPTIONS'
290:debug:build CPATH='/opt/local/include'
291:debug:build CPLUS_INCLUDE_PATH='/opt/local/include/LegacySupport:/opt/local/include/libcxx/v1'
292:debug:build C_INCLUDE_PATH='/opt/local/include/LegacySupport:/opt/local/include/libcxx/v1'
293:debug:build DEVELOPER_DIR='/Library/Developer/CommandLineTools'
294:debug:build LIBRARY_PATH='/opt/local/lib'
295:debug:build MACOSX_DEPLOYMENT_TARGET='10.12'
296:debug:build MACPORTS_LEGACY_SUPPORT_CPPFLAGS='-isystem/opt/local/include/LegacySupport -nostdinc++ -isystem/opt/local/include/libcxx/v1'
297:debug:build MACPORTS_LEGACY_SUPPORT_ENABLED='1'
298:debug:build MACPORTS_LEGACY_SUPPORT_LDFLAGS='-L/opt/local/lib -lMacportsLegacySupport -L/opt/local/lib/libcxx'
299:debug:build OBJCPLUS_INCLUDE_PATH='/opt/local/include/LegacySupport:/opt/local/include/libcxx/v1'
300:debug:build OBJC_INCLUDE_PATH='/opt/local/include/LegacySupport:/opt/local/include/libcxx/v1'
301:debug:build SOURCE_DATE_EPOCH='1759894490'
302:info:build Executing:  cd "/opt/local/var/macports/build/ccache-71117637/work/build" && /usr/bin/make -j24 -w all VERBOSE=ON
303:debug:build system:  cd "/opt/local/var/macports/build/ccache-71117637/work/build" && /usr/bin/make -j24 -w all VERBOSE=ON
304:info:build make: Entering directory `/opt/local/var/macports/build/ccache-71117637/work/build'
305:info:build /opt/local/bin/cmake -S/opt/local/var/macports/build/ccache-71117637/work/ccache-4.12.1 -B/opt/local/var/macports/build/ccache-71117637/work/build --check-build-system CMakeFiles/Makefile.cmake 0
306:info:build /opt/local/bin/cmake -E cmake_progress_start /opt/local/var/macports/build/ccache-71117637/work/build/CMakeFiles /opt/local/var/macports/build/ccache-71117637/work/build//CMakeFiles/progress.marks
307:info:build /Library/Developer/CommandLineTools/usr/bin/make  -f CMakeFiles/Makefile2 all
308:info:build make[1]: Entering directory `/opt/local/var/macports/build/ccache-71117637/work/build'
309:info:build /Library/Developer/CommandLineTools/usr/bin/make  -f src/third_party/fmt/CMakeFiles/dep_fmt.dir/build.make src/third_party/fmt/CMakeFiles/dep_fmt.dir/depend
310:info:build /Library/Developer/CommandLineTools/usr/bin/make  -f src/third_party/cxxurl/CMakeFiles/dep_cxxurl.dir/build.make src/third_party/cxxurl/CMakeFiles/dep_cxxurl.dir/depend
311:info:build /Library/Developer/CommandLineTools/usr/bin/make  -f src/third_party/blake3/CMakeFiles/dep_blake3.dir/build.make src/third_party/blake3/CMakeFiles/dep_blake3.dir/depend
312:info:build /Library/Developer/CommandLineTools/usr/bin/make  -f doc/CMakeFiles/doc-man-page.dir/build.make doc/CMakeFiles/doc-man-page.dir/depend
313:info:build /Library/Developer/CommandLineTools/usr/bin/make  -f doc/CMakeFiles/doc-html.dir/build.make doc/CMakeFiles/doc-html.dir/depend
314:info:build make[2]: Entering directory `/opt/local/var/macports/build/ccache-71117637/work/build'
315:info:build cd /opt/local/var/macports/build/ccache-71117637/work/build && /opt/local/bin/cmake -E cmake_depends "Unix Makefiles" /opt/local/var/macports/build/ccache-71117637/work/ccache-4.12.1 /opt/local/var/macports/build/ccache-71117637/work/ccache-4.12.1/src/third_party/cxxurl /opt/local/var/macports/build/ccache-71117637/work/build /opt/local/var/macports/build/ccache-71117637/work/build/src/third_party/cxxurl /opt/local/var/macports/build/ccache-71117637/work/build/src/third_party/cxxurl/CMakeFiles/dep_cxxurl.dir/DependInfo.cmake "--color="
316:info:build make[2]: Entering directory `/opt/local/var/macports/build/ccache-71117637/work/build'
317:info:build cd /opt/local/var/macports/build/ccache-71117637/work/build && /opt/local/bin/cmake -E cmake_depends "Unix Makefiles" /opt/local/var/macports/build/ccache-71117637/work/ccache-4.12.1 /opt/local/var/macports/build/ccache-71117637/work/ccache-4.12.1/src/third_party/fmt /opt/local/var/macports/build/ccache-71117637/work/build /opt/local/var/macports/build/ccache-71117637/work/build/src/third_party/fmt /opt/local/var/macports/build/ccache-71117637/work/build/src/third_party/fmt/CMakeFiles/dep_fmt.dir/DependInfo.cmake "--color="
318:info:build make[2]: Entering directory `/opt/local/var/macports/build/ccache-71117637/work/build'
319:info:build cd /opt/local/var/macports/build/ccache-71117637/work/build && /opt/local/bin/cmake -E cmake_depends "Unix Makefiles" /opt/local/var/macports/build/ccache-71117637/work/ccache-4.12.1 /opt/local/var/macports/build/ccache-71117637/work/ccache-4.12.1/src/third_party/blake3 /opt/local/var/macports/build/ccache-71117637/work/build /opt/local/var/macports/build/ccache-71117637/work/build/src/third_party/blake3 /opt/local/var/macports/build/ccache-71117637/work/build/src/third_party/blake3/CMakeFiles/dep_blake3.dir/DependInfo.cmake "--color="
320:info:build make[2]: Entering directory `/opt/local/var/macports/build/ccache-71117637/work/build'
321:info:build cd /opt/local/var/macports/build/ccache-71117637/work/build && /opt/local/bin/cmake -E cmake_depends "Unix Makefiles" /opt/local/var/macports/build/ccache-71117637/work/ccache-4.12.1 /opt/local/var/macports/build/ccache-71117637/work/ccache-4.12.1/doc /opt/local/var/macports/build/ccache-71117637/work/build /opt/local/var/macports/build/ccache-71117637/work/build/doc /opt/local/var/macports/build/ccache-71117637/work/build/doc/CMakeFiles/doc-man-page.dir/DependInfo.cmake "--color="
322:info:build make[2]: Entering directory `/opt/local/var/macports/build/ccache-71117637/work/build'
323:info:build cd /opt/local/var/macports/build/ccache-71117637/work/build && /opt/local/bin/cmake -E cmake_depends "Unix Makefiles" /opt/local/var/macports/build/ccache-71117637/work/ccache-4.12.1 /opt/local/var/macports/build/ccache-71117637/work/ccache-4.12.1/doc /opt/local/var/macports/build/ccache-71117637/work/build /opt/local/var/macports/build/ccache-71117637/work/build/doc /opt/local/var/macports/build/ccache-71117637/work/build/doc/CMakeFiles/doc-html.dir/DependInfo.cmake "--color="
324:info:build Dependee "/opt/local/var/macports/build/ccache-71117637/work/build/src/third_party/blake3/CMakeFiles/dep_blake3.dir/DependInfo.cmake" is newer than depender "/opt/local/var/macports/build/ccache-71117637/work/build/src/third_party/blake3/CMakeFiles/dep_blake3.dir/depend.internal".
325:info:build Dependee "/opt/local/var/macports/build/ccache-71117637/work/build/src/third_party/blake3/CMakeFiles/CMakeDirectoryInformation.cmake" is newer than depender "/opt/local/var/macports/build/ccache-71117637/work/build/src/third_party/blake3/CMakeFiles/dep_blake3.dir/depend.internal".
326:info:build make[2]: Leaving directory `/opt/local/var/macports/build/ccache-71117637/work/build'
327:info:build make[2]: Leaving directory `/opt/local/var/macports/build/ccache-71117637/work/build'
328:info:build make[2]: Leaving directory `/opt/local/var/macports/build/ccache-71117637/work/build'
329:info:build /Library/Developer/CommandLineTools/usr/bin/make  -f doc/CMakeFiles/doc-html.dir/build.make doc/CMakeFiles/doc-html.dir/build
330:info:build make[2]: Leaving directory `/opt/local/var/macports/build/ccache-71117637/work/build'
331:info:build /Library/Developer/CommandLineTools/usr/bin/make  -f doc/CMakeFiles/doc-man-page.dir/build.make doc/CMakeFiles/doc-man-page.dir/build
332:info:build /Library/Developer/CommandLineTools/usr/bin/make  -f src/third_party/cxxurl/CMakeFiles/dep_cxxurl.dir/build.make src/third_party/cxxurl/CMakeFiles/dep_cxxurl.dir/build
333:info:build /Library/Developer/CommandLineTools/usr/bin/make  -f src/third_party/fmt/CMakeFiles/dep_fmt.dir/build.make src/third_party/fmt/CMakeFiles/dep_fmt.dir/build
334:info:build Scanning dependencies of target dep_blake3
335:info:build make[2]: Entering directory `/opt/local/var/macports/build/ccache-71117637/work/build'
336:info:build make[2]: Entering directory `/opt/local/var/macports/build/ccache-71117637/work/build'
337:info:build make[2]: Entering directory `/opt/local/var/macports/build/ccache-71117637/work/build'
338:info:build make[2]: Entering directory `/opt/local/var/macports/build/ccache-71117637/work/build'
339:info:build make[2]: Leaving directory `/opt/local/var/macports/build/ccache-71117637/work/build'
340:info:build /Library/Developer/CommandLineTools/usr/bin/make  -f src/third_party/blake3/CMakeFiles/dep_blake3.dir/build.make src/third_party/blake3/CMakeFiles/dep_blake3.dir/build
341:info:build make[2]: Entering directory `/opt/local/var/macports/build/ccache-71117637/work/build'
342:info:build [  0%] Generating MANUAL.html
343:info:build [  0%] Building CXX object src/third_party/fmt/CMakeFiles/dep_fmt.dir/fmt/format.cc.o
344:info:build [  5%] Generating NEWS.html
345:info:build [  4%] Generating ccache.1
346:info:build [  5%] Generating LICENSE.html
347:info:build [  5%] Building CXX object src/third_party/cxxurl/CMakeFiles/dep_cxxurl.dir/cxxurl/url.cpp.o
348:info:build [  5%] Generating AUTHORS.html
349:info:build cd /opt/local/var/macports/build/ccache-71117637/work/build/doc && /opt/local/bin/asciidoctor -o MANUAL.html -a revnumber="4.12.1" -a icons=font -a toc=left -a sectanchors -a stylesheet="/opt/local/var/macports/build/ccache-71117637/work/ccache-4.12.1/doc/ccache-doc.css" -b html /opt/local/var/macports/build/ccache-71117637/work/ccache-4.12.1/doc/MANUAL.adoc
350:info:build cd /opt/local/var/macports/build/ccache-71117637/work/build/src/third_party/fmt && /opt/local/bin/ccache /opt/local/bin/clang++-mp-16  -isystem /opt/local/var/macports/build/ccache-71117637/work/ccache-4.12.1/src/third_party/fmt -pipe -Os -DNDEBUG -isystem/opt/local/include/libcxx/v1 -nostdinc++ -isystem/opt/local/include/LegacySupport -I/opt/local/include -stdlib=libc++ -std=c++17 -arch x86_64 -mmacosx-version-min=10.12 -include /opt/local/var/macports/build/ccache-71117637/work/build/config.h -MD -MT src/third_party/fmt/CMakeFiles/dep_fmt.dir/fmt/format.cc.o -MF CMakeFiles/dep_fmt.dir/fmt/format.cc.o.d -o CMakeFiles/dep_fmt.dir/fmt/format.cc.o -c /opt/local/var/macports/build/ccache-71117637/work/ccache-4.12.1/src/third_party/fmt/fmt/format.cc
351:info:build cd /opt/local/var/macports/build/ccache-71117637/work/build/doc && /opt/local/bin/asciidoctor -o AUTHORS.html -a revnumber="4.12.1" -a icons=font -a toc=left -a sectanchors -a stylesheet="/opt/local/var/macports/build/ccache-71117637/work/ccache-4.12.1/doc/ccache-doc.css" -b html /opt/local/var/macports/build/ccache-71117637/work/ccache-4.12.1/doc/AUTHORS.adoc
352:info:build cd /opt/local/var/macports/build/ccache-71117637/work/build/doc && /opt/local/bin/asciidoctor -o ccache.1 -a revnumber="4.12.1" -a icons=font -a toc=left -a sectanchors -a stylesheet="/opt/local/var/macports/build/ccache-71117637/work/ccache-4.12.1/doc/ccache-doc.css" -b manpage /opt/local/var/macports/build/ccache-71117637/work/ccache-4.12.1/doc/MANUAL.adoc
353:info:build cd /opt/local/var/macports/build/ccache-71117637/work/build/src/third_party/cxxurl && /opt/local/bin/ccache /opt/local/bin/clang++-mp-16   -pipe -Os -DNDEBUG -isystem/opt/local/include/libcxx/v1 -nostdinc++ -isystem/opt/local/include/LegacySupport -I/opt/local/include -stdlib=libc++ -std=c++17 -arch x86_64 -mmacosx-version-min=10.12 -MD -MT src/third_party/cxxurl/CMakeFiles/dep_cxxurl.dir/cxxurl/url.cpp.o -MF CMakeFiles/dep_cxxurl.dir/cxxurl/url.cpp.o.d -o CMakeFiles/dep_cxxurl.dir/cxxurl/url.cpp.o -c /opt/local/var/macports/build/ccache-71117637/work/ccache-4.12.1/src/third_party/cxxurl/cxxurl/url.cpp
354:info:build cd /opt/local/var/macports/build/ccache-71117637/work/build/doc && /opt/local/bin/asciidoctor -o NEWS.html -a revnumber="4.12.1" -a icons=font -a toc=left -a sectanchors -a stylesheet="/opt/local/var/macports/build/ccache-71117637/work/ccache-4.12.1/doc/ccache-doc.css" -b html /opt/local/var/macports/build/ccache-71117637/work/ccache-4.12.1/doc/NEWS.adoc
355:info:build cd /opt/local/var/macports/build/ccache-71117637/work/build/doc && /opt/local/bin/asciidoctor -o LICENSE.html -a revnumber="4.12.1" -a icons=font -a toc=left -a sectanchors -a stylesheet="/opt/local/var/macports/build/ccache-71117637/work/ccache-4.12.1/doc/ccache-doc.css" -b html /opt/local/var/macports/build/ccache-71117637/work/ccache-4.12.1/LICENSE.adoc
356:info:build [  6%] Building C object src/third_party/blake3/CMakeFiles/dep_blake3.dir/blake3/blake3.c.o
357:info:build [  7%] Building C object src/third_party/blake3/CMakeFiles/dep_blake3.dir/blake3/blake3_portable.c.o
358:info:build [  9%] Building ASM object src/third_party/blake3/CMakeFiles/dep_blake3.dir/blake3/blake3_sse2_x86-64_unix.S.o
359:info:build [  9%] Building ASM object src/third_party/blake3/CMakeFiles/dep_blake3.dir/blake3/blake3_sse41_x86-64_unix.S.o
360:info:build [ 10%] Building C object src/third_party/blake3/CMakeFiles/dep_blake3.dir/blake3/blake3_dispatch.c.o
361:info:build [ 10%] Building ASM object src/third_party/blake3/CMakeFiles/dep_blake3.dir/blake3/blake3_avx512_x86-64_unix.S.o
362:info:build cd /opt/local/var/macports/build/ccache-71117637/work/build/src/third_party/blake3 && /opt/local/bin/ccache /opt/local/bin/clang-mp-16   -pipe -Os -DNDEBUG -isystem/opt/local/include/libcxx/v1 -nostdinc++ -isystem/opt/local/include/LegacySupport -I/opt/local/include -std=c99 -arch x86_64 -mmacosx-version-min=10.12 -include /opt/local/var/macports/build/ccache-71117637/work/build/config.h -MD -MT src/third_party/blake3/CMakeFiles/dep_blake3.dir/blake3/blake3.c.o -MF CMakeFiles/dep_blake3.dir/blake3/blake3.c.o.d -o CMakeFiles/dep_blake3.dir/blake3/blake3.c.o -c /opt/local/var/macports/build/ccache-71117637/work/ccache-4.12.1/src/third_party/blake3/blake3/blake3.c
363:info:build cd /opt/local/var/macports/build/ccache-71117637/work/build/src/third_party/blake3 && /opt/local/bin/ccache /opt/local/bin/clang-mp-16   -pipe -Os -DNDEBUG -isystem/opt/local/include/libcxx/v1 -nostdinc++ -isystem/opt/local/include/LegacySupport -I/opt/local/include -std=c99 -arch x86_64 -mmacosx-version-min=10.12 -include /opt/local/var/macports/build/ccache-71117637/work/build/config.h -MD -MT src/third_party/blake3/CMakeFiles/dep_blake3.dir/blake3/blake3_portable.c.o -MF CMakeFiles/dep_blake3.dir/blake3/blake3_portable.c.o.d -o CMakeFiles/dep_blake3.dir/blake3/blake3_portable.c.o -c /opt/local/var/macports/build/ccache-71117637/work/ccache-4.12.1/src/third_party/blake3/blake3/blake3_portable.c
364:info:build [ 10%] Building ASM object src/third_party/blake3/CMakeFiles/dep_blake3.dir/blake3/blake3_avx2_x86-64_unix.S.o
365:info:build cd /opt/local/var/macports/build/ccache-71117637/work/build/src/third_party/blake3 && /opt/local/bin/clang-mp-16   -arch x86_64 -mmacosx-version-min=10.12 -include /opt/local/var/macports/build/ccache-71117637/work/build/config.h -msse2 -o CMakeFiles/dep_blake3.dir/blake3/blake3_sse2_x86-64_unix.S.o -c /opt/local/var/macports/build/ccache-71117637/work/ccache-4.12.1/src/third_party/blake3/blake3/blake3_sse2_x86-64_unix.S
366:info:build cd /opt/local/var/macports/build/ccache-71117637/work/build/src/third_party/blake3 && /opt/local/bin/clang-mp-16   -arch x86_64 -mmacosx-version-min=10.12 -include /opt/local/var/macports/build/ccache-71117637/work/build/config.h -msse4.1 -o CMakeFiles/dep_blake3.dir/blake3/blake3_sse41_x86-64_unix.S.o -c /opt/local/var/macports/build/ccache-71117637/work/ccache-4.12.1/src/third_party/blake3/blake3/blake3_sse41_x86-64_unix.S
367:info:build cd /opt/local/var/macports/build/ccache-71117637/work/build/src/third_party/blake3 && /opt/local/bin/clang-mp-16   -arch x86_64 -mmacosx-version-min=10.12 -include /opt/local/var/macports/build/ccache-71117637/work/build/config.h -mavx512f -mavx512vl -o CMakeFiles/dep_blake3.dir/blake3/blake3_avx512_x86-64_unix.S.o -c /opt/local/var/macports/build/ccache-71117637/work/ccache-4.12.1/src/third_party/blake3/blake3/blake3_avx512_x86-64_unix.S
368:info:build cd /opt/local/var/macports/build/ccache-71117637/work/build/src/third_party/blake3 && /opt/local/bin/ccache /opt/local/bin/clang-mp-16   -pipe -Os -DNDEBUG -isystem/opt/local/include/libcxx/v1 -nostdinc++ -isystem/opt/local/include/LegacySupport -I/opt/local/include -std=c99 -arch x86_64 -mmacosx-version-min=10.12 -include /opt/local/var/macports/build/ccache-71117637/work/build/config.h -MD -MT src/third_party/blake3/CMakeFiles/dep_blake3.dir/blake3/blake3_dispatch.c.o -MF CMakeFiles/dep_blake3.dir/blake3/blake3_dispatch.c.o.d -o CMakeFiles/dep_blake3.dir/blake3/blake3_dispatch.c.o -c /opt/local/var/macports/build/ccache-71117637/work/ccache-4.12.1/src/third_party/blake3/blake3/blake3_dispatch.c
369:info:build cd /opt/local/var/macports/build/ccache-71117637/work/build/src/third_party/blake3 && /opt/local/bin/clang-mp-16   -arch x86_64 -mmacosx-version-min=10.12 -include /opt/local/var/macports/build/ccache-71117637/work/build/config.h -mavx2 -o CMakeFiles/dep_blake3.dir/blake3/blake3_avx2_x86-64_unix.S.o -c /opt/local/var/macports/build/ccache-71117637/work/ccache-4.12.1/src/third_party/blake3/blake3/blake3_avx2_x86-64_unix.S
370:info:build dyld: Library not loaded: /opt/local/lib/libhiredis.1.1.0.dylib
371:info:build   Referenced from: /opt/local/bin/ccache
372:info:build   Reason: image not found
373:info:build /bin/sh: line 1: 52106 Abort trap: 6           /opt/local/bin/ccache /opt/local/bin/clang++-mp-16 -isystem /opt/local/var/macports/build/ccache-71117637/work/ccache-4.12.1/src/third_party/fmt -pipe -Os -DNDEBUG -isystem/opt/local/include/libcxx/v1 -nostdinc++ -isystem/opt/local/include/LegacySupport -I/opt/local/include -stdlib=libc++ -std=c++17 -arch x86_64 -mmacosx-version-min=10.12 -include /opt/local/var/macports/build/ccache-71117637/work/build/config.h -MD -MT src/third_party/fmt/CMakeFiles/dep_fmt.dir/fmt/format.cc.o -MF CMakeFiles/dep_fmt.dir/fmt/format.cc.o.d -o CMakeFiles/dep_fmt.dir/fmt/format.cc.o -c /opt/local/var/macports/build/ccache-71117637/work/ccache-4.12.1/src/third_party/fmt/fmt/format.cc
374:info:build make[2]: *** [src/third_party/fmt/CMakeFiles/dep_fmt.dir/fmt/format.cc.o] Error 134
375:info:build make[2]: Leaving directory `/opt/local/var/macports/build/ccache-71117637/work/build'
376:info:build make[1]: *** [src/third_party/fmt/CMakeFiles/dep_fmt.dir/all] Error 2
377:info:build make[1]: *** Waiting for unfinished jobs....
378:info:build dyld: Library not loaded: /opt/local/lib/libhiredis.1.1.0.dylib
379:info:build   Referenced from: /opt/local/bin/ccache
380:info:build   Reason: image not found
381:info:build dyld: Library not loaded: /opt/local/lib/libhiredis.1.1.0.dylib
382:info:build   Referenced from: /opt/local/bin/ccache
383:info:build   Reason: image not found
384:info:build dyld: Library not loaded: /opt/local/lib/libhiredis.1.1.0.dylib
385:info:build   Referenced from: /opt/local/bin/ccache
386:info:build   Reason: image not found
387:info:build /bin/sh: line 1: 52108 Abort trap: 6           /opt/local/bin/ccache /opt/local/bin/clang++-mp-16 -pipe -Os -DNDEBUG -isystem/opt/local/include/libcxx/v1 -nostdinc++ -isystem/opt/local/include/LegacySupport -I/opt/local/include -stdlib=libc++ -std=c++17 -arch x86_64 -mmacosx-version-min=10.12 -MD -MT src/third_party/cxxurl/CMakeFiles/dep_cxxurl.dir/cxxurl/url.cpp.o -MF CMakeFiles/dep_cxxurl.dir/cxxurl/url.cpp.o.d -o CMakeFiles/dep_cxxurl.dir/cxxurl/url.cpp.o -c /opt/local/var/macports/build/ccache-71117637/work/ccache-4.12.1/src/third_party/cxxurl/cxxurl/url.cpp
388:info:build /bin/sh: line 1: 52112 Abort trap: 6           /opt/local/bin/ccache /opt/local/bin/clang-mp-16 -pipe -Os -DNDEBUG -isystem/opt/local/include/libcxx/v1 -nostdinc++ -isystem/opt/local/include/LegacySupport -I/opt/local/include -std=c99 -arch x86_64 -mmacosx-version-min=10.12 -include /opt/local/var/macports/build/ccache-71117637/work/build/config.h -MD -MT src/third_party/blake3/CMakeFiles/dep_blake3.dir/blake3/blake3.c.o -MF CMakeFiles/dep_blake3.dir/blake3/blake3.c.o.d -o CMakeFiles/dep_blake3.dir/blake3/blake3.c.o -c /opt/local/var/macports/build/ccache-71117637/work/ccache-4.12.1/src/third_party/blake3/blake3/blake3.c
389:info:build /bin/sh: line 1: 52113 Abort trap: 6           /opt/local/bin/ccache /opt/local/bin/clang-mp-16 -pipe -Os -DNDEBUG -isystem/opt/local/include/libcxx/v1 -nostdinc++ -isystem/opt/local/include/LegacySupport -I/opt/local/include -std=c99 -arch x86_64 -mmacosx-version-min=10.12 -include /opt/local/var/macports/build/ccache-71117637/work/build/config.h -MD -MT src/third_party/blake3/CMakeFiles/dep_blake3.dir/blake3/blake3_portable.c.o -MF CMakeFiles/dep_blake3.dir/blake3/blake3_portable.c.o.d -o CMakeFiles/dep_blake3.dir/blake3/blake3_portable.c.o -c /opt/local/var/macports/build/ccache-71117637/work/ccache-4.12.1/src/third_party/blake3/blake3/blake3_portable.c
390:info:build make[2]: *** [src/third_party/cxxurl/CMakeFiles/dep_cxxurl.dir/cxxurl/url.cpp.o] Error 134
391:info:build make[2]: Leaving directory `/opt/local/var/macports/build/ccache-71117637/work/build'
392:info:build make[2]: *** [src/third_party/blake3/CMakeFiles/dep_blake3.dir/blake3/blake3_portable.c.o] Error 134
393:info:build make[2]: *** Waiting for unfinished jobs....
394:info:build make[2]: *** [src/third_party/blake3/CMakeFiles/dep_blake3.dir/blake3/blake3.c.o] Error 134
395:info:build dyld: Library not loaded: /opt/local/lib/libhiredis.1.1.0.dylib
396:info:build   Referenced from: /opt/local/bin/ccache
397:info:build   Reason: image not found
398:info:build make[1]: *** [src/third_party/cxxurl/CMakeFiles/dep_cxxurl.dir/all] Error 2
399:info:build /bin/sh: line 1: 52116 Abort trap: 6           /opt/local/bin/ccache /opt/local/bin/clang-mp-16 -pipe -Os -DNDEBUG -isystem/opt/local/include/libcxx/v1 -nostdinc++ -isystem/opt/local/include/LegacySupport -I/opt/local/include -std=c99 -arch x86_64 -mmacosx-version-min=10.12 -include /opt/local/var/macports/build/ccache-71117637/work/build/config.h -MD -MT src/third_party/blake3/CMakeFiles/dep_blake3.dir/blake3/blake3_dispatch.c.o -MF CMakeFiles/dep_blake3.dir/blake3/blake3_dispatch.c.o.d -o CMakeFiles/dep_blake3.dir/blake3/blake3_dispatch.c.o -c /opt/local/var/macports/build/ccache-71117637/work/ccache-4.12.1/src/third_party/blake3/blake3/blake3_dispatch.c
400:info:build make[2]: *** [src/third_party/blake3/CMakeFiles/dep_blake3.dir/blake3/blake3_dispatch.c.o] Error 134
401:info:build make[2]: Leaving directory `/opt/local/var/macports/build/ccache-71117637/work/build'
402:info:build make[1]: *** [src/third_party/blake3/CMakeFiles/dep_blake3.dir/all] Error 2
403:info:build cd /opt/local/var/macports/build/ccache-71117637/work/build/doc && perl -pi -e 's!\\f\(CR(.*?)\\fP!\\fB\1\\fP!g' ccache.1
404:info:build make[2]: Leaving directory `/opt/local/var/macports/build/ccache-71117637/work/build'
405:info:build make[2]: Leaving directory `/opt/local/var/macports/build/ccache-71117637/work/build'
406:info:build [ 10%] Built target doc-man-page
407:info:build [ 10%] Built target doc-html
408:info:build make[1]: Leaving directory `/opt/local/var/macports/build/ccache-71117637/work/build'
409:info:build make: *** [all] Error 2
410:info:build make: Leaving directory `/opt/local/var/macports/build/ccache-71117637/work/build'
411:info:build Command failed:  cd "/opt/local/var/macports/build/ccache-71117637/work/build" && /usr/bin/make -j24 -w all VERBOSE=ON
412:info:build Exit code: 2
413:error:build Failed to build ccache: command execution failed
414:debug:build Error code: CHILDSTATUS 52052 2
415:debug:build Backtrace: command execution failed
416:debug:build     while executing
417:debug:build "system {*}$notty {*}$callback {*}$nice $fullcmdstring"
418:debug:build     invoked from within
419:debug:build "command_exec -callback portprogress::target_progress_callback build"
420:debug:build     (procedure "portbuild::build_main" line 10)
421:debug:build     invoked from within
422:debug:build "$procedure $targetname"
423:error:build See /opt/local/var/macports/logs/_opt_local_var_macports_sources_rsync.macports.org_macports_release_tarballs_ports_devel_ccache/ccache/main.log for details.