Ticket #74045: main.log

File main.log, 25.8 KB (added by ballapete (Peter "Pete" Dyballa), 4 months ago)

Main.log from PPC Leopard, Mac OS X 10.5.8

Line 
1version:1
2:debug:main Starting logging for expat @2.8.1_0
3:debug:sysinfo Mac OS X 10.5.8 (darwin/9.8.0) arch powerpc
4:debug:sysinfo MacPorts 2.12.5
5:debug:sysinfo Xcode 3.1.4, CLT none
6:debug:sysinfo SDK 10.5
7:debug:sysinfo MACOSX_DEPLOYMENT_TARGET: 10.5
8:msg:main --->  Computing dependencies for expat:info:main .:debug:main Searching for dependency: lbzip2
9:debug:main Found Dependency: receipt exists for lbzip2
10:debug:main Executing org.macports.main (expat)
11:debug:main dropping privileges: euid changed to 502, egid changed to 502.
12:debug:main Privilege de-escalation not attempted as not running as root.
13:debug:archivefetch archivefetch phase started at 2026-05-28T14:22:18.430+0000 (Thu May 28 16:22:18 CEST 2026)
14:debug:archivefetch Executing org.macports.archivefetch (expat)
15:debug:archivefetch Privilege de-escalation not attempted as not running as root.
16:debug:fetch fetch phase started at 2026-05-28T14:22:18.619+0000 (Thu May 28 16:22:18 CEST 2026)
17:notice:fetch --->  Fetching distfiles for expat
18:debug:fetch Executing org.macports.fetch (expat)
19:debug:fetch Fetching http://nchc.dl.sourceforge.net/project/expat/expat/2.8.1/expat-2.8.1.tar.bz2 failed: The requested URL returned error: 400
20:debug:fetch Privilege de-escalation not attempted as not running as root.
21:debug:checksum checksum phase started at 2026-05-28T14:22:18.660+0000 (Thu May 28 16:22:18 CEST 2026)
22:notice:checksum --->  Verifying checksums for expat
23:debug:checksum Executing org.macports.checksum (expat)
24:info:checksum --->  Checksumming expat-2.8.1.tar.bz2
25:debug:checksum Calculated (rmd160) is d96d2b5701954eed8cd6c6bbc24264c457dc08ad
26:debug:checksum Correct (rmd160) checksum for expat-2.8.1.tar.bz2
27:debug:checksum Calculated (sha256) is f5833dd2e1cd7739ec9182804a1a29c4f0cc7c2f26b633d3a2188b7766a88ecb
28:debug:checksum Correct (sha256) checksum for expat-2.8.1.tar.bz2
29:debug:checksum Calculated (size) is 655697
30:debug:checksum Correct (size) checksum for expat-2.8.1.tar.bz2
31:debug:checksum Privilege de-escalation not attempted as not running as root.
32:debug:extract extract phase started at 2026-05-28T14:22:18.735+0000 (Thu May 28 16:22:18 CEST 2026)
33:notice:extract --->  Extracting expat
34:debug:extract Executing org.macports.extract (expat)
35:info:extract --->  Extracting expat-2.8.1.tar.bz2
36:debug:extract setting option extract.args to '/opt/local/var/macports/distfiles/expat/expat-2.8.1.tar.bz2'
37:debug:extract Environment:
38:debug:extract CC_PRINT_OPTIONS='YES'
39:debug:extract CC_PRINT_OPTIONS_FILE='/opt/local/var/macports/build/expat-e9b9624d/work/.CC_PRINT_OPTIONS'
40:debug:extract CPATH='/opt/local/include'
41:debug:extract DEVELOPER_DIR='/Developer'
42:debug:extract LIBRARY_PATH='/opt/local/lib'
43:debug:extract MACOSX_DEPLOYMENT_TARGET='10.5'
44:debug:extract SOURCE_DATE_EPOCH='1779924779'
45:info:extract Executing:  cd "/opt/local/var/macports/build/expat-e9b9624d/work" && /opt/local/bin/lbzip2 -dc '/opt/local/var/macports/distfiles/expat/expat-2.8.1.tar.bz2' | /usr/bin/gnutar --no-same-owner -xf -
46:debug:extract system:  cd "/opt/local/var/macports/build/expat-e9b9624d/work" && /opt/local/bin/lbzip2 -dc '/opt/local/var/macports/distfiles/expat/expat-2.8.1.tar.bz2' | /usr/bin/gnutar --no-same-owner -xf -
47:debug:extract euid/egid changed to: 0/0
48:debug:extract chowned /opt/local/var/macports/build/expat-e9b9624d/work to macports
49:debug:extract euid/egid changed to: 502/502
50:debug:extract Privilege de-escalation not attempted as not running as root.
51:debug:patch patch phase started at 2026-05-28T14:22:35.657+0000 (Thu May 28 16:22:35 CEST 2026)
52:debug:patch Executing org.macports.patch (expat)
53:debug:patch Privilege de-escalation not attempted as not running as root.
54:debug:configure configure phase started at 2026-05-28T14:22:35.919+0000 (Thu May 28 16:22:35 CEST 2026)
55:notice:configure --->  Configuring expat
56:debug:configure Preferred compilers: gcc-4.2 llvm-gcc-4.2 apple-gcc-4.2 gcc-4.0 macports-gcc-15 macports-gcc-14 macports-gcc-10 macports-gcc-7 macports-gcc-6 macports-gcc-5
57:debug:configure Using compiler 'Xcode GCC 4.2'
58:debug:configure Executing org.macports.configure (expat)
59:debug:configure Environment:
60:debug:configure CC='/usr/bin/gcc-4.2'
61:debug:configure CC_PRINT_OPTIONS='YES'
62:debug:configure CC_PRINT_OPTIONS_FILE='/opt/local/var/macports/build/expat-e9b9624d/work/.CC_PRINT_OPTIONS'
63:debug:configure CFLAGS='-pipe -Os -arch ppc'
64:debug:configure CPATH='/opt/local/include'
65:debug:configure CPPFLAGS='-I/opt/local/include'
66:debug:configure CXX='/usr/bin/g++-4.2'
67:debug:configure CXXFLAGS='-pipe -Os -arch ppc'
68:debug:configure DEVELOPER_DIR='/Developer'
69:debug:configure F90FLAGS='-pipe -Os -m32'
70:debug:configure FCFLAGS='-pipe -Os -m32'
71:debug:configure FFLAGS='-pipe -Os -m32'
72:debug:configure INSTALL='/usr/bin/install -c'
73:debug:configure LDFLAGS='-L/opt/local/lib -Wl,-headerpad_max_install_names -arch ppc'
74:debug:configure LIBRARY_PATH='/opt/local/lib'
75:debug:configure MACOSX_DEPLOYMENT_TARGET='10.5'
76:debug:configure OBJC='/usr/bin/gcc-4.2'
77:debug:configure OBJCFLAGS='-pipe -Os -arch ppc'
78:debug:configure OBJCXX='/usr/bin/g++-4.2'
79:debug:configure OBJCXXFLAGS='-pipe -Os -arch ppc'
80:debug:configure SOURCE_DATE_EPOCH='1779924779'
81:info:configure Executing:  cd "/opt/local/var/macports/build/expat-e9b9624d/work/expat-2.8.1" && ./configure --prefix=/opt/local --without-docbook --without-tests
82:debug:configure system:  cd "/opt/local/var/macports/build/expat-e9b9624d/work/expat-2.8.1" && ./configure --prefix=/opt/local --without-docbook --without-tests
83:info:configure checking build system type... powerpc-apple-darwin9.8.0
84:info:configure checking host system type... powerpc-apple-darwin9.8.0
85:info:configure checking for a BSD-compatible install... /usr/bin/install -c
86:info:configure checking whether sleep supports fractional seconds... yes
87:info:configure checking filesystem timestamp resolution... 2
88:info:configure checking whether build environment is sane... yes
89:info:configure checking for a race-free mkdir -p... /opt/local/bin/gmkdir -p
90:info:configure checking for gawk... gawk
91:info:configure checking whether make sets $(MAKE)... yes
92:info:configure checking whether make supports nested variables... yes
93:info:configure checking xargs -n works... yes
94:info:configure checking whether UID '502' is supported by ustar format... yes
95:info:configure checking whether GID '502' is supported by ustar format... yes
96:info:configure checking how to create a ustar tar archive... gnutar
97:info:configure checking whether to enable maintainer-specific portions of Makefiles... yes
98:info:configure checking whether make supports the include directive... yes (GNU style)
99:info:configure checking for gcc... /usr/bin/gcc-4.2
100:info:configure checking whether the C compiler works... yes
101:info:configure checking for C compiler default output file name... a.out
102:info:configure checking for suffix of executables...
103:info:configure checking whether we are cross compiling... no
104:info:configure checking for suffix of object files... o
105:info:configure checking whether the compiler supports GNU C... yes
106:info:configure checking whether /usr/bin/gcc-4.2 accepts -g... yes
107:info:configure checking for /usr/bin/gcc-4.2 option to enable C11 features... unsupported
108:info:configure checking for /usr/bin/gcc-4.2 option to enable C99 features... -std=gnu99
109:info:configure checking whether /usr/bin/gcc-4.2 -std=gnu99 understands -c and -o together... yes
110:info:configure checking dependency style of /usr/bin/gcc-4.2 -std=gnu99... gcc3
111:info:configure checking for ar... ar
112:info:configure checking the archiver (ar) interface... ar
113:info:configure checking whether make sets $(MAKE)... (cached) yes
114:info:configure checking how to print strings... printf
115:info:configure checking for a sed that does not truncate output... /opt/local/bin/gsed
116:info:configure checking for grep that handles long lines and -e... /opt/local/bin/ggrep
117:info:configure checking for egrep... /opt/local/bin/ggrep -E
118:info:configure checking for fgrep... /opt/local/bin/ggrep -F
119:info:configure checking for ld used by /usr/bin/gcc-4.2 -std=gnu99... /usr/libexec/gcc/powerpc-apple-darwin9/4.2.1/ld
120:info:configure checking if the linker (/usr/libexec/gcc/powerpc-apple-darwin9/4.2.1/ld) is GNU ld... no
121:info:configure checking for BSD- or MS-compatible name lister (nm)... /usr/bin/nm -p
122:info:configure checking the name lister (/usr/bin/nm -p) interface... BSD nm
123:info:configure checking whether ln -s works... yes
124:info:configure checking the maximum length of command line arguments... 196608
125:info:configure checking how to convert powerpc-apple-darwin9.8.0 file names to powerpc-apple-darwin9.8.0 format... func_convert_file_noop
126:info:configure checking how to convert powerpc-apple-darwin9.8.0 file names to toolchain format... func_convert_file_noop
127:info:configure checking for /usr/libexec/gcc/powerpc-apple-darwin9/4.2.1/ld option to reload object files... -r
128:info:configure checking for file... file
129:info:configure checking for objdump... no
130:info:configure checking how to recognize dependent libraries... pass_all
131:info:configure checking for dlltool... no
132:info:configure checking how to associate runtime and link libraries... printf %s\n
133:info:configure checking for ranlib... ranlib
134:info:configure checking for archiver @FILE support... no
135:info:configure checking for strip... strip
136:info:configure checking command to parse /usr/bin/nm -p output from /usr/bin/gcc-4.2 -std=gnu99 object... ok
137:info:configure checking for sysroot... no
138:info:configure checking for a working dd... /bin/dd
139:info:configure checking how to truncate binary pipes... /bin/dd bs=4096 count=1
140:info:configure checking for mt... no
141:info:configure checking if : is a manifest tool... no
142:info:configure checking for dsymutil... dsymutil
143:info:configure checking for nmedit... nmedit
144:info:configure checking for lipo... lipo
145:info:configure checking for otool... otool
146:info:configure checking for otool64... no
147:info:configure checking for -single_module linker flag... yes
148:info:configure checking for -no_fixup_chains linker flag... no
149:info:configure checking for -exported_symbols_list linker flag... yes
150:info:configure checking for -force_load linker flag... ld: unknown option: -force_load
151:info:configure no
152:info:configure checking for stdio.h... yes
153:info:configure checking for stdlib.h... yes
154:info:configure checking for string.h... yes
155:info:configure checking for inttypes.h... yes
156:info:configure checking for stdint.h... yes
157:info:configure checking for strings.h... yes
158:info:configure checking for sys/stat.h... yes
159:info:configure checking for sys/types.h... yes
160:info:configure checking for unistd.h... yes
161:info:configure checking for sys/param.h... yes
162:info:configure checking for dlfcn.h... yes
163:info:configure checking for objdir... .libs
164:info:configure checking if /usr/bin/gcc-4.2 -std=gnu99 supports -fno-rtti -fno-exceptions... no
165:info:configure checking for /usr/bin/gcc-4.2 -std=gnu99 option to produce PIC... -fno-common -DPIC
166:info:configure checking if /usr/bin/gcc-4.2 -std=gnu99 PIC flag -fno-common -DPIC works... yes
167:info:configure checking if /usr/bin/gcc-4.2 -std=gnu99 static flag -static works... no
168:info:configure checking if /usr/bin/gcc-4.2 -std=gnu99 supports -c -o file.o... yes
169:info:configure checking if /usr/bin/gcc-4.2 -std=gnu99 supports -c -o file.o... (cached) yes
170:info:configure checking whether the /usr/bin/gcc-4.2 -std=gnu99 linker (/usr/libexec/gcc/powerpc-apple-darwin9/4.2.1/ld) supports shared libraries... yes
171:info:configure checking dynamic linker characteristics... darwin9.8.0 dyld
172:info:configure checking how to hardcode library paths into programs... immediate
173:info:configure checking whether stripping libraries is possible... yes
174:info:configure checking if libtool supports shared libraries... yes
175:info:configure checking whether to build shared libraries... yes
176:info:configure checking whether to build static libraries... yes
177:info:configure checking whether C compiler accepts -Wall... yes
178:info:configure checking whether C compiler accepts -Wextra... yes
179:info:configure checking whether C compiler accepts -fexceptions... yes
180:info:configure checking whether C compiler accepts -Wstrict-aliasing=3... yes
181:info:configure checking whether C compiler accepts -Wmissing-prototypes... yes
182:info:configure checking whether C compiler accepts -Wstrict-prototypes... yes
183:info:configure checking whether C compiler accepts -pedantic... yes
184:info:configure checking whether C compiler accepts -Wduplicated-cond... no
185:info:configure checking whether C compiler accepts -Wduplicated-branches... no
186:info:configure checking whether C compiler accepts -Wlogical-op... no
187:info:configure checking whether C compiler accepts -Wrestrict... no
188:info:configure checking whether C compiler accepts -Wnull-dereference... no
189:info:configure checking whether C compiler accepts -Wjump-misses-init... no
190:info:configure checking whether C compiler accepts -Wdouble-promotion... no
191:info:configure checking whether C compiler accepts -Wshadow... yes
192:info:configure checking whether C compiler accepts -Wformat=2... yes
193:info:configure checking whether C compiler accepts -Wmisleading-indentation... no
194:info:configure checking whether the compiler supports GNU C++... yes
195:info:configure checking whether /usr/bin/g++-4.2 accepts -g... yes
196:info:configure checking for /usr/bin/g++-4.2 option to enable C++11 features... unsupported
197:info:configure checking for /usr/bin/g++-4.2 option to enable C++98 features... unsupported
198:info:configure checking dependency style of /usr/bin/g++-4.2... gcc3
199:info:configure checking how to run the C++ preprocessor... /usr/bin/g++-4.2 -E
200:info:configure checking for ld used by /usr/bin/g++-4.2... /usr/libexec/gcc/powerpc-apple-darwin9/4.2.1/ld
201:info:configure checking if the linker (/usr/libexec/gcc/powerpc-apple-darwin9/4.2.1/ld) is GNU ld... no
202:info:configure checking whether the /usr/bin/g++-4.2 linker (/usr/libexec/gcc/powerpc-apple-darwin9/4.2.1/ld) supports shared libraries... yes
203:info:configure checking for /usr/bin/g++-4.2 option to produce PIC... -fno-common -DPIC
204:info:configure checking if /usr/bin/g++-4.2 PIC flag -fno-common -DPIC works... yes
205:info:configure checking if /usr/bin/g++-4.2 static flag -static works... no
206:info:configure checking if /usr/bin/g++-4.2 supports -c -o file.o... yes
207:info:configure checking if /usr/bin/g++-4.2 supports -c -o file.o... (cached) yes
208:info:configure checking whether the /usr/bin/g++-4.2 linker (/usr/libexec/gcc/powerpc-apple-darwin9/4.2.1/ld) supports shared libraries... yes
209:info:configure checking dynamic linker characteristics... darwin9.8.0 dyld
210:info:configure checking how to hardcode library paths into programs... immediate
211:info:configure checking whether C++ compiler accepts -Wall... yes
212:info:configure checking whether C++ compiler accepts -Wextra... yes
213:info:configure checking whether C++ compiler accepts -fexceptions... yes
214:info:configure checking whether C++ compiler accepts -Wstrict-aliasing=3... yes
215:info:configure checking whether the linker accepts -Wstrict-aliasing=3... yes
216:info:configure checking whether compiler supports visibility... no
217:info:configure checking whether byte ordering is bigendian... yes
218:info:configure checking for an ANSI C-conforming const... yes
219:info:configure checking for arc4random_buf (BSD or glibc 2.36+)... no
220:info:configure checking for arc4random (BSD, macOS, or glibc 2.36+)... yes
221:info:configure checking for getentropy (BSD, macOS 10.12+, glibc 2.25+)... no
222:info:configure checking for getrandom (Linux 3.17+, glibc 2.25+)... no
223:info:configure checking for syscall SYS_getrandom (Linux 3.17+)... no
224:info:configure checking for fcntl.h... yes
225:info:configure checking for unistd.h... (cached) yes
226:info:configure checking for off_t... yes
227:info:configure checking for getpagesize... yes
228:info:configure checking for working mmap... yes
229:info:configure checking for shared library name prefix... lib
230:info:configure checking that generated files are newer than configure... done
231:info:configure configure: creating ./config.status
232:info:configure config.status: creating Makefile
233:info:configure config.status: creating expat.pc
234:info:configure config.status: creating cmake/expat-config.cmake
235:info:configure config.status: creating cmake/autotools/expat.cmake
236:info:configure config.status: creating cmake/autotools/expat-config-version.cmake
237:info:configure config.status: creating cmake/autotools/expat-noconfig.cmake
238:info:configure config.status: creating doc/Makefile
239:info:configure config.status: creating examples/Makefile
240:info:configure config.status: creating lib/Makefile
241:info:configure config.status: creating lib/libexpat.map
242:info:configure config.status: creating tests/Makefile
243:info:configure config.status: creating tests/benchmark/Makefile
244:info:configure config.status: creating xmlwf/Makefile
245:info:configure config.status: creating run.sh
246:info:configure config.status: creating expat_config.h
247:info:configure config.status: executing depfiles commands
248:info:configure config.status: executing libtool commands
249:info:configure configure:
250:info:configure Automake flags (can be overridden by user flags):
251:info:configure   AM_CPPFLAGS:
252:info:configure     AM_CFLAGS: -Wall -Wextra -fexceptions -Wstrict-aliasing=3 -Wmissing-prototypes -Wstrict-prototypes -pedantic -Wshadow -Wformat=2
253:info:configure   AM_CXXFLAGS: -Wall -Wextra -fexceptions -Wstrict-aliasing=3
254:info:configure    AM_LDFLAGS: -Wstrict-aliasing=3
255:info:configure User flags (override Automake flags on conflict):
256:info:configure      CPPFLAGS: -I/opt/local/include
257:info:configure        CFLAGS: -pipe -Os -arch ppc
258:info:configure      CXXFLAGS: -pipe -Os -arch ppc
259:info:configure       LDFLAGS: -L/opt/local/lib -Wl,-headerpad_max_install_names -arch ppc
260:info:configure Entropy sources:
261:info:configure              arc4random: true
262:info:configure          arc4random_buf: false
263:info:configure              getentropy: false
264:info:configure               getrandom: false
265:info:configure   syscall SYS_getrandom: false
266:info:configure            /dev/urandom: true
267:info:configure Continue with e.g.:
268:info:configure   make -j2
269:info:configure   make check
270:info:configure   sudo make install
271:debug:configure Executing portconfigure::configure_finish
272:debug:configure Privilege de-escalation not attempted as not running as root.
273:debug:build build phase started at 2026-05-28T14:23:18.266+0000 (Thu May 28 16:23:18 CEST 2026)
274:notice:build --->  Building expat
275:debug:build Executing org.macports.build (expat)
276:debug:build Environment:
277:debug:build CC_PRINT_OPTIONS='YES'
278:debug:build CC_PRINT_OPTIONS_FILE='/opt/local/var/macports/build/expat-e9b9624d/work/.CC_PRINT_OPTIONS'
279:debug:build CPATH='/opt/local/include'
280:debug:build DEVELOPER_DIR='/Developer'
281:debug:build LIBRARY_PATH='/opt/local/lib'
282:debug:build MACOSX_DEPLOYMENT_TARGET='10.5'
283:debug:build SOURCE_DATE_EPOCH='1779924779'
284:info:build Executing:  cd "/opt/local/var/macports/build/expat-e9b9624d/work/expat-2.8.1" && /usr/bin/make -w all
285:debug:build system:  cd "/opt/local/var/macports/build/expat-e9b9624d/work/expat-2.8.1" && /usr/bin/make -w all
286:info:build make: Entering directory `/opt/local/var/macports/build/expat-e9b9624d/work/expat-2.8.1'
287:info:build /usr/bin/make  all-recursive
288:info:build make[1]: Entering directory `/opt/local/var/macports/build/expat-e9b9624d/work/expat-2.8.1'
289:info:build Making all in lib
290:info:build make[2]: Entering directory `/opt/local/var/macports/build/expat-e9b9624d/work/expat-2.8.1/lib'
291:info:build /bin/sh ../libtool  --tag=CC   --mode=compile /usr/bin/gcc-4.2 -std=gnu99 -DHAVE_CONFIG_H -I. -I..   -I/opt/local/include -Wall -Wextra -fexceptions -Wstrict-aliasing=3 -Wmissing-prototypes -Wstrict-prototypes -pedantic -Wshadow -Wformat=2 -pipe -Os -arch ppc -MT xmlparse.lo -MD -MP -MF .deps/xmlparse.Tpo -c -o xmlparse.lo xmlparse.c
292:info:build libtool: compile:  /usr/bin/gcc-4.2 -std=gnu99 -DHAVE_CONFIG_H -I. -I.. -I/opt/local/include -Wall -Wextra -fexceptions -Wstrict-aliasing=3 -Wmissing-prototypes -Wstrict-prototypes -pedantic -Wshadow -Wformat=2 -pipe -Os -arch ppc -MT xmlparse.lo -MD -MP -MF .deps/xmlparse.Tpo -c xmlparse.c  -fno-common -DPIC -o .libs/xmlparse.o
293:info:build libtool: compile:  /usr/bin/gcc-4.2 -std=gnu99 -DHAVE_CONFIG_H -I. -I.. -I/opt/local/include -Wall -Wextra -fexceptions -Wstrict-aliasing=3 -Wmissing-prototypes -Wstrict-prototypes -pedantic -Wshadow -Wformat=2 -pipe -Os -arch ppc -MT xmlparse.lo -MD -MP -MF .deps/xmlparse.Tpo -c xmlparse.c -o xmlparse.o >/dev/null 2>&1
294:info:build mv -f .deps/xmlparse.Tpo .deps/xmlparse.Plo
295:info:build /bin/sh ../libtool  --tag=CC   --mode=compile /usr/bin/gcc-4.2 -std=gnu99 -DHAVE_CONFIG_H -I. -I..   -I/opt/local/include -Wall -Wextra -fexceptions -Wstrict-aliasing=3 -Wmissing-prototypes -Wstrict-prototypes -pedantic -Wshadow -Wformat=2 -pipe -Os -arch ppc -MT xmltok.lo -MD -MP -MF .deps/xmltok.Tpo -c -o xmltok.lo xmltok.c
296:info:build libtool: compile:  /usr/bin/gcc-4.2 -std=gnu99 -DHAVE_CONFIG_H -I. -I.. -I/opt/local/include -Wall -Wextra -fexceptions -Wstrict-aliasing=3 -Wmissing-prototypes -Wstrict-prototypes -pedantic -Wshadow -Wformat=2 -pipe -Os -arch ppc -MT xmltok.lo -MD -MP -MF .deps/xmltok.Tpo -c xmltok.c  -fno-common -DPIC -o .libs/xmltok.o
297:info:build libtool: compile:  /usr/bin/gcc-4.2 -std=gnu99 -DHAVE_CONFIG_H -I. -I.. -I/opt/local/include -Wall -Wextra -fexceptions -Wstrict-aliasing=3 -Wmissing-prototypes -Wstrict-prototypes -pedantic -Wshadow -Wformat=2 -pipe -Os -arch ppc -MT xmltok.lo -MD -MP -MF .deps/xmltok.Tpo -c xmltok.c -o xmltok.o >/dev/null 2>&1
298:info:build mv -f .deps/xmltok.Tpo .deps/xmltok.Plo
299:info:build /bin/sh ../libtool  --tag=CC   --mode=compile /usr/bin/gcc-4.2 -std=gnu99 -DHAVE_CONFIG_H -I. -I..   -I/opt/local/include -Wall -Wextra -fexceptions -Wstrict-aliasing=3 -Wmissing-prototypes -Wstrict-prototypes -pedantic -Wshadow -Wformat=2 -pipe -Os -arch ppc -MT xmlrole.lo -MD -MP -MF .deps/xmlrole.Tpo -c -o xmlrole.lo xmlrole.c
300:info:build libtool: compile:  /usr/bin/gcc-4.2 -std=gnu99 -DHAVE_CONFIG_H -I. -I.. -I/opt/local/include -Wall -Wextra -fexceptions -Wstrict-aliasing=3 -Wmissing-prototypes -Wstrict-prototypes -pedantic -Wshadow -Wformat=2 -pipe -Os -arch ppc -MT xmlrole.lo -MD -MP -MF .deps/xmlrole.Tpo -c xmlrole.c  -fno-common -DPIC -o .libs/xmlrole.o
301:info:build libtool: compile:  /usr/bin/gcc-4.2 -std=gnu99 -DHAVE_CONFIG_H -I. -I.. -I/opt/local/include -Wall -Wextra -fexceptions -Wstrict-aliasing=3 -Wmissing-prototypes -Wstrict-prototypes -pedantic -Wshadow -Wformat=2 -pipe -Os -arch ppc -MT xmlrole.lo -MD -MP -MF .deps/xmlrole.Tpo -c xmlrole.c -o xmlrole.o >/dev/null 2>&1
302:info:build mv -f .deps/xmlrole.Tpo .deps/xmlrole.Plo
303:info:build /bin/sh ../libtool  --tag=CC   --mode=compile /usr/bin/gcc-4.2 -std=gnu99 -DHAVE_CONFIG_H -I. -I..   -I/opt/local/include -Wall -Wextra -fexceptions -Wstrict-aliasing=3 -Wmissing-prototypes -Wstrict-prototypes -pedantic -Wshadow -Wformat=2 -pipe -Os -arch ppc -MT random_arc4random.lo -MD -MP -MF .deps/random_arc4random.Tpo -c -o random_arc4random.lo random_arc4random.c
304:info:build libtool: compile:  /usr/bin/gcc-4.2 -std=gnu99 -DHAVE_CONFIG_H -I. -I.. -I/opt/local/include -Wall -Wextra -fexceptions -Wstrict-aliasing=3 -Wmissing-prototypes -Wstrict-prototypes -pedantic -Wshadow -Wformat=2 -pipe -Os -arch ppc -MT random_arc4random.lo -MD -MP -MF .deps/random_arc4random.Tpo -c random_arc4random.c  -fno-common -DPIC -o .libs/random_arc4random.o
305:info:build libtool: compile:  /usr/bin/gcc-4.2 -std=gnu99 -DHAVE_CONFIG_H -I. -I.. -I/opt/local/include -Wall -Wextra -fexceptions -Wstrict-aliasing=3 -Wmissing-prototypes -Wstrict-prototypes -pedantic -Wshadow -Wformat=2 -pipe -Os -arch ppc -MT random_arc4random.lo -MD -MP -MF .deps/random_arc4random.Tpo -c random_arc4random.c -o random_arc4random.o >/dev/null 2>&1
306:info:build mv -f .deps/random_arc4random.Tpo .deps/random_arc4random.Plo
307:info:build /bin/sh ../libtool  --tag=CC   --mode=compile /usr/bin/gcc-4.2 -std=gnu99 -DHAVE_CONFIG_H -I. -I..   -I/opt/local/include -Wall -Wextra -fexceptions -Wstrict-aliasing=3 -Wmissing-prototypes -Wstrict-prototypes -pedantic -Wshadow -Wformat=2 -pipe -Os -arch ppc -MT random_dev_urandom.lo -MD -MP -MF .deps/random_dev_urandom.Tpo -c -o random_dev_urandom.lo random_dev_urandom.c
308:info:build libtool: compile:  /usr/bin/gcc-4.2 -std=gnu99 -DHAVE_CONFIG_H -I. -I.. -I/opt/local/include -Wall -Wextra -fexceptions -Wstrict-aliasing=3 -Wmissing-prototypes -Wstrict-prototypes -pedantic -Wshadow -Wformat=2 -pipe -Os -arch ppc -MT random_dev_urandom.lo -MD -MP -MF .deps/random_dev_urandom.Tpo -c random_dev_urandom.c  -fno-common -DPIC -o .libs/random_dev_urandom.o
309:info:build random_dev_urandom.c: In function 'writeRandomBytes_dev_urandom':
310:info:build random_dev_urandom.c:50: error: 'O_CLOEXEC' undeclared (first use in this function)
311:info:build random_dev_urandom.c:50: error: (Each undeclared identifier is reported only once
312:info:build random_dev_urandom.c:50: error: for each function it appears in.)
313:info:build make[2]: *** [random_dev_urandom.lo] Error 1
314:info:build make[2]: Leaving directory `/opt/local/var/macports/build/expat-e9b9624d/work/expat-2.8.1/lib'
315:info:build make[1]: *** [all-recursive] Error 1
316:info:build make[1]: Leaving directory `/opt/local/var/macports/build/expat-e9b9624d/work/expat-2.8.1'
317:info:build make: *** [all] Error 2
318:info:build make: Leaving directory `/opt/local/var/macports/build/expat-e9b9624d/work/expat-2.8.1'
319:info:build Command failed:  cd "/opt/local/var/macports/build/expat-e9b9624d/work/expat-2.8.1" && /usr/bin/make -w all
320:info:build Exit code: 2
321:error:build Failed to build expat: command execution failed
322:debug:build Error code: CHILDSTATUS 28899 2
323:debug:build Backtrace: command execution failed
324:debug:build     while executing
325:debug:build "system {*}$notty {*}$callback {*}$nice $fullcmdstring"
326:debug:build     invoked from within
327:debug:build "command_exec -callback portprogress::target_progress_callback build"
328:debug:build     (procedure "portbuild::build_main" line 10)
329:debug:build     invoked from within
330:debug:build "$procedure $targetname"
331:error:build See /opt/local/var/macports/logs/_Volumes_BSD-Linux_MacPorts-Ports_textproc_expat/expat/main.log for details.