Custom Query (125 matches)

Filters
 
Or
 
  
 
Columns

Show under each result:


Results (1 - 100 of 125)

1 2
Ticket Summary Status Keywords Owner Type Priority
#16598 ettercap do not work on Mac OS X 10.5.5 new leopard macports-tickets@… defect Normal
#27289 libtorrent, libtorrent-devel fail to build on 10.5 and 10.4 assigned leopard tiger defect Normal
#31472 pextlib crash/segfault in curl code new snowleopard macports-tickets@… defect Normal
#34990 shogun: Undefined symbols: _drot_ _dswap_ __gfortran_concat_string _dgemm_ etc. new snowleopard macports-tickets@… defect Normal
#35887 xrg: XRGAppDelegate.m:82: error: request for member 'frame' in something not a structure or union new snowleopard macports-tickets@… defect Normal
#36667 HandBrakeCLI @0.10.0_0: cannot link to libiconv assigned snowleopard larryv (Lawrence Velázquez) defect Normal
#36686 gearmand @0.41_0+sqlite requires compiler specification on a 10.5.8 PPC new leopard macports-tickets@… defect Normal
#37385 Qpdf @3.0.2 does not build on PPC Leopard Mac OS X 10.5.8 because of test failure for Pl_ASCII85Decoder reopened leopard powerpc macports-tickets@… defect Normal
#37402 phantomjs: cc1plus: error: unrecognized command line option "-mavx" new snowleopard macports-tickets@… defect Normal
#38425 dvdisaster: build failure OS X 10.5.8 G4 PPC new leopard powerpc mklein-de (Michael Klein) defect Normal
#38958 R @3.0.0_0: build failure on OS X 10.6.8 new snowleopard kjellpk (Kjell Konis) defect Normal
#40478 gcc-4.8 (and likely earlier) build incorrectly +universal new universal leopard larryv (Lawrence Velázquez) defect Normal
#40807 graphviz @2.34.0: dot hangs when generating doxymentation on 10.6 new snowleopard macports-tickets@… defect Normal
#41648 gcc48: Bootstrap comparison failure assigned leopard macports-tickets@… defect Normal
#41678 v8 @3.23.15: undefined symbols v8::Isolate::ThrowException etc. assigned leopard macports-tickets@… defect Normal
#44667 gcc49 @4.9.3: build fails on Leopard new leopard larryv (Lawrence Velázquez) defect Normal
#46469 libgcc-devel @5-20150104: ld: absolute addressing (perhaps -mdynamic-no-pic) used in _byte_common_op_match_null_string_p from ../libiberty/pic/libiberty.a(regex.o) not allowed in slidable image assigned leopard powerpc macports-tickets@… defect Normal
#46890 vtk @6.1.0 build fails on G4, Leopard new leopard powerpc stromnov (Andrew Stromnov) defect Normal
#47288 sbcl @1.2.9 fails building on a 10.5.8 PPC new leopard powerpc easye defect Normal
#47670 mono @3.2.5_0 build broken on 10.5.8 power mac g5 accepted leopard MarcusCalhoun-Lopez (Marcus Calhoun-Lopez) defect Normal
#48047 wcslib fails in destroot phase on G4 running Leopard 10.5.8 assigned Leopard defect Normal
#48064 py27-astropy fails in build stage on G4 running Leopard 10.5.8 assigned leopard powerpc defect Normal
#50736 org-mode @8.3.3, org-mode-devel @devel: emacs-24.5 hangs with 100% CPU use new snowleopard drkp (Dan Ports) defect Normal
#50737 Can't install camlimages (libcxx) new snowleopard macports-tickets@… defect Normal
#50957 panda: broken on 10.6 assigned snowleopard mojca (Mojca Miklavec) defect Normal
#51557 mp3fs build error on Leopard i366 new powerpc leopard macports-tickets@… defect Normal
#51896 php70 @7.0.9: PHAR build fails on Mac OS X 10.5.8 new leopard ryandesign (Ryan Schmidt) defect Normal
#51897 php70-apache2handler @7.0.9: Can't be linked on 10.5.8 new leopard ryandesign (Ryan Schmidt) defect Normal
#52058 netcdf @4.4.1: error: redefinition of typedef ‘DCEparsestate’ new snowleopard tenomoto (Takeshi Enomoto) defect Normal
#52091 cctools, ld64: Removing +llvm33 variant introduces circular dependencies on Leopard due to llvm-3.4 failing to build with Xcode 3.1's gcc new leopard jeremyhu (Jeremy Huddleston Sequoia) defect Normal
#52117 Qpdf @6.0.0 does not build on PPC Leopard, Mac OS X 10.5.8 because of Undefined symbol "Pl_MD5::persistAcrossFinish(bool)" that ld could not find new leopard powerpc macports-tickets@… defect Normal
#52430 osxfuse@3.5.0 build fails on Leopard new leopard i386 drkp (Dan Ports) defect Normal
#52466 gnuregex @0.12: symbol dyld_stub_binder not found (normally in libSystem.dylib) assigned leopard tiger ryandesign (Ryan Schmidt) defect Normal
#53073 py35-ipython @5.1.0 does not run on a PPC running OSX 10.5.8 assigned leopard powerpc lpsinger (Leo Singer) defect Normal
#53074 clhep @2.3.4.3: fails to build on 10.6 due to unsupported thread-local storage new snowleopard mojca (Mojca Miklavec) defect Normal
#53193 mysql57: Unsupported compiler! assigned snowleopard defect Normal
#54393 Port fails to execute an upgrade with the additional arguments given at invocation but uses it for upgrading the ports on which the given port depends new tiger leopard snowleopard defect Normal
#54411 elftoolchain @0.7.1 won't build on Snow Leopard, Mac OS X 10.6.8, (cxx_stdlib = libc++) because of "Undefined symbols for architecture x86_64" assigned snowleopard legacy-os raimue (Rainer Müller) defect Normal
#54418 ftgl @2.1.3-rc5 fails to build on SnowLeopard, Mac OS X 10.6.8, because build dependency to GLUT is not recorded? new snowleopard defect Normal
#54519 py27-cryptography @2.0: error: -Werror=sign-conversion: No option -Wsign-conversion assigned tiger leopard snowleopard stromnov (Andrew Stromnov) defect Normal
#54640 py27-cryptography @2.0.3 does not build on PPC Leopard, Mac OS X 10.5.8, because "Symbol not found: _PyUnicodeUCS2_FromObject" assigned leopard stromnov (Andrew Stromnov) defect Normal
#54799 gtk-doc @1.26 does not build on PPC Leopard, Mac OS X 10.5.8, because "Symbol not found: _PyUnicodeUCS2_AsUTF8String" assigned leopard dbevans (David B. Evans) defect Normal
#55442 libunwind @3.9.1: UNREACHABLE executed! new leopard jeremyhu (Jeremy Huddleston Sequoia) defect Normal
#55443 libcxx, libcxxabi @3.9.1: All compilers are either blacklisted or unavailable new leopard jeremyhu (Jeremy Huddleston Sequoia) defect Normal
#55523 opencv @3.2.0_1: Build failure with ffmpeg-devel @20171210 assigned snowleopard stromnov (Andrew Stromnov) defect Normal
#55525 py27-pynacl @1.2.1_1 does not build on PPC Leopard, Mac OS X 10.5.8, because Symbol not found: _PyUnicodeUCS2_FromObject assigned leopard stromnov (Andrew Stromnov) defect Normal
#55528 py27-cython @0.27.3 built on Mac OS X 10.5.8, Leopard, stops py27-cryptography, py27-pynacl, nghttp2 from building assigned leopard stromnov (Andrew Stromnov) defect Normal
#55831 postgis2 fails to compile on Snow Leopard assigned snowleopard Veence (Vincent) defect Normal
#55920 FreeRDP @2.0.0-rc1: error: unknown type name 'AudioFormatID' new tiger leopard snowleopard lion mountainlion mavericks defect Normal
#55988 xercesc3 @3.2.1: ld: duplicate symbol xercesc_3_2::ArrayJanitor<unsigned char>::ArrayJanitor(unsigned char*)in xercesc/util/.libs/TransService.o and xercesc/util/.libs/PlatformUtils.o new tiger leopard snowleopard nerdling (Jeremy Lavergne) defect Normal
#56042 Bundle libc++ with MacPorts on 10.6 new snowleopard enhancement Normal
#56457 use_dmg: /usr/bin/cpio: illegal option -- 0 new tiger leopard snowleopard defect Normal
#56458 python*: Compiler path is baked into _sysconfigdata.py new snowleopard, haspatch defect Normal
#56513 gtk-doc @1.28_1 does not build on PPC Leopard, Mac OS X 10.5.8, because Python with UCS4 support is missing? new leopard defect Normal
#56742 qemu @2.12.0_0+cocoa+target_i386+target_ppc+target_x86_64+usb.darwin_9.ppc: Build error - build failure assigned powerpc leopard legacy-os raimue (Rainer Müller) defect Normal
#57036 GTK3 patch to compile on 10.5 and 10.6 assigned snowleopard leopard tiger dbevans (David B. Evans) defect Normal
#57078 py27-numpy fails to compile with standard compiler on 10.5 due to: immintrin.h: No such file or directory assigned leopard michaelld (Michael Dickens) defect Normal
#57333 xorg-server-devel @1.20.1 does not build on Mac OS X 10.5.8, Leopard, because of redefinition of typedef ‘CARD32’ assigned leopard jeremyhu (Jeremy Huddleston Sequoia) defect Normal
#57486 ace, tao @6.5.2: cc1plus: error: unrecognized command line option "-stdlib=libstdc++" assigned snowleopard lockhart (Thomas Lockhart) defect Normal
#57520 py-pyopencl: Does not build on libstdc++ systems; does not honor MacPorts build flags assigned snowleopard lion mountainlion petrrr defect Normal
#57656 gcc6: backport of cmath fixes new haspatch leopard snowleopard defect Normal
#57911 libcxx @5.0.1_4: does not install without following the LibcxxOnOlderSystems instructions on 10.5 Leopard Intel reopened leopard jeremyhu (Jeremy Huddleston Sequoia) defect Normal
#58082 Gimp 2.10.8 patches for Leopard and SnowLeopard to enable +quartz variant assigned leopard snowleopard dbevans (David B. Evans) defect Normal
#58104 gtk3: patches for Leopard and SnowLeopard assigned leopard snowleopard haspatch dbevans (David B. Evans) defect Normal
#58109 MPlayer: error: invalid output constraint '=o' in asm new snowleopard defect Normal
#58220 Qgis on Snow Leopard assigned snowleopard Veence (Vincent) defect Normal
#58407 error in building gexiv2 0.10.9 on 10.6.8 assigned snowleopard dbevans (David B. Evans) defect Normal
#58520 ucommon-7.0.0 fails to build on Mac OS X 10.5 Leopard: error: 'AI_NUMERICSERV' was not declared in this scope new leopard defect Normal
#58522 py27-shiboken fails to build on Mac OS X 10.5 Leopard assigned leopard mamoll (Mark Moll) defect Normal
#58552 harfbuzz @2.5.1 does not build on PPC Leopard, Mac OS X 10.5.8, because some warnings being treated as errors assigned leopard ryandesign (Ryan Schmidt) defect Normal
#58578 cmake fails to compile on Leopard (lround) assigned leopard i386 legacy-os michaelld (Michael Dickens) defect Normal
#58605 cryptlib @3.4.5: Build fails due to undefined _Static_assert assigned snowleopard defect Normal
#58616 irrlicht fails to build on Mac OSX 10.5 Leopard PPC assigned leopard defect Normal
#58619 libgcc fails on leopard ppc boostrap-lean new leopard powerpc defect Normal
#58624 Capstone Fails To Install On Mac OSX 10.5 Leopard PPC assigned leopard powerpc aquynh defect Normal
#58641 libftd2xx fails to install on Mac OSX 10.5 Leopard assigned Leopard ranauei defect Normal
#58677 legacy support issue while building cmake (Leopard) new leopard i386 legacy-os defect Normal
#58834 gimp nm issues on 10.5 assigned leopard dbevans (David B. Evans) defect Normal
#58839 p11-kit nm issues on leopard new nm leopard defect Normal
#58893 nodejs12 @12.9.1: error: use of undeclared identifier 'strnlen' assigned snowleopard ci42 defect Normal
#58898 libcxx bootstrapping needs a method to upgrade to the +emulatedtls variant on 10.6 and less assigned snowleopard leopard tiger kencu (Ken) defect Normal
#58927 findutils @4.7.0_0 cannot be instaalled on PPC Mac OS X 10.5.8, Leopard, on HFSX because of some infinite loop? new leopard defect Normal
#59073 [mysql57] compile failure on 10.6.8 x86_64 new snowleopard defect Normal
#59115 libssh2 @1.9.0 fails to build on PPC Mac OS X 10.5.8 because '#pragma GCC diagnostic not allowed inside functions' assigned leopard Gminfly defect Normal
#59187 afl @2.52b: requires memmem(3), only available on OS X 10.7 or greater assigned tiger leopard snowleopard myint (Steven Myint) defect Normal
#59211 mariadb 5.5.65_0 fails to build on 10.6.8 assigned snowleopard michaelld (Michael Dickens) defect Normal
#59279 libomp: should use clang_dependency portgroup assigned snowleopard lion mountainlion eborisch (Eric A. Borisch) defect Normal
#59371 harfbuzz fails to compile on i386 older macs assigned i386 leopard ryandesign (Ryan Schmidt) defect Normal
#59373 gtk3 @3.24.12 does not build on PPC Mac OS X 10.5.8, Leopard, because "too many nested evaluations (infinite loop?)" assigned leopard dbevans (David B. Evans) defect Normal
#59466 python27 +universal fails to build universal extension modules in standard library assigned leopard snowleopard jmroot (Joshua Root) defect Normal
#59599 kubectl-1.16 @1.16.2: dyld: Symbol not found: _unlinkat assigned mavericks mountainlion lion snowleopard leopard tiger patarra@… defect Normal
#59621 poppler does not build on legacy Leopard assigned leopard legacy-os dbevans (David B. Evans) defect Normal
#59664 source-highlight @3.1.9 does not build on PPC Mac OS X 10.5.8, Leopard, because new source-highlight binary cannot produc HTML doc from Java source file reopened leopard defect Normal
#59691 After a time, MacPorts cannot determine the Xcode version, on Snow Leopard new snowleopard defect Normal
#59726 strigi @0.7.8: build fails on 10.6.8: error: no matching function for call to 'make_pair' new snowleopard defect Normal
#59780 cmake fails to build on Leopard 10.5: error: 'shared_mutex' is unavailable: introduced in macOS 10.12 assigned leopard michaelld (Michael Dickens) defect Normal
#60028 p5.30-proc-guard, p5.30-log-dispatch: dyld: lazy symbol binding failed: Symbol not found: _perl_tsa_mutex_lock assigned snowleopard dbevans (David B. Evans) defect Normal
#60203 curl fails to build due to old nm assigned leopard ryandesign (Ryan Schmidt) defect Normal
#60250 fribidi fails to build due to nm new leopard tiger defect Normal
#60251 gobject-introspection fails for old nm new leopard defect Normal
1 2
Note: See TracQuery for help on using queries.