Custom Query (32 matches)

Filters
 
Or
 
  
 
Columns

Show under each result:


Ticket Summary Status Type Priority Milestone Component
#17217 mod_mono does not generate mod_mono.so accepted defect Normal ports
#28571 mod_mono is not going to work like this accepted defect Normal ports
#42489 mono-addins failed to compile accepted defect Normal ports
#43527 add monodevelop accepted request Normal ports
#47670 mono @3.2.5_0 build broken on 10.5.8 power mac g5 accepted defect Normal ports
#56318 Base should know the installed version of the command line tools accepted enhancement Normal base
#58275 octave does not build graphics toolkit qt with qt4 assigned defect Normal ports
#58378 Qt5 CMake component fails under Xcode-10.2 assigned defect Normal ports
#58807 xdmf: Error: Failed to activate xdmf: Image error: /opt/local/include/ProjectVersion.hpp is being used by the active vtk port assigned defect Normal ports
#58925 octave +fltk @5.1.0_1 build failure: ld: framework not found OpenGL assigned defect Normal ports
#59153 dbus @1.12.16_0: Startup items not started correctly assigned defect Normal ports
#59534 msbuild: error MSB4019: The imported project ... was not found reopened defect Normal ports
#59601 qt5-qt3d @ 5.12.5 configure fails ERROR: Feature 'system-assimp' was enabled, but the pre-condition 'features.assimp && libs.assimp' failed assigned defect Normal ports
#59972 msbuild: build fails with mktemp usage message assigned defect Normal ports
#59999 libedit @20191231-3.1_0 build failure with hfscompression assigned defect Normal ports
#60300 petsc @3.12.4: clang: error: unable to execute command: Segmentation fault: 11 assigned defect Normal ports
#60514 qt5-mysql-plugin: add variant for mariadb 10.2 assigned enhancement Normal ports
#60659 opencascade @7.4: Undefined symbols StdLPersistent_Collection::instance assigned defect Normal ports
#60696 gdcm @3.0.5: fatal error: 'CharLS/charls.h' file not found assigned defect Normal ports
#60697 gdcm: Update to 3.0.6 assigned update Normal ports
#60760 netgen @6.2.2004: fatal error: 'optional' file not found assigned defect Normal ports
#60829 py38-clawpack: ld: file too small (length=0) assigned defect Normal ports
#60889 qt59-qtconnectivity 5.9.9: Fails to build (casting pointers to bool in Bluetooth code) assigned defect Normal ports
#60944 qt5: Support arm64 assigned enhancement Normal ports
#60985 phantomjs-qt-qtbase: build error assigned defect Normal ports
#61031 qt5*-qtlocation: build errors due to <experimental/optional> removal assigned defect Normal ports
#61102 dbus-python38 @1.2.16:error:Failed to build dbus-python38: command execution failed assigned defect Normal ports
#61103 qt5-qtbase @5.14.2_1:error:cannot be run on this version of macOS. Qt requires macOS 11.0.0 or later, you have macOS 10.16.0. assigned defect Normal ports
#61126 verilator: fails to compile "trace" output assigned defect Normal ports
#61140 gdcm2: xsltParseStylesheetProcess : document is not a stylesheet assigned defect Normal ports
#61141 luminance-hdr: Could not find a package configuration file provided by "Eigen3" assigned defect Normal ports
#61151 mono @6.10.0.104: build fails on 10.8 and earlier assigned defect Normal ports
Note: See TracQuery for help on using queries.