Custom Query (121 matches)

Filters
 
Or
 
  
 
Columns

Show under each result:


Results (1 - 100 of 121)

1 2
Ticket Summary Status Type Priority Milestone Component
#22279 RFE: add ruby and python binding variants to GEOS library port new enhancement Normal ports
#23558 omniORB: +universal variant fails new defect Normal ports
#24663 postgis 1.4 - 1.5 upgrade impossible? ERROR: could not access file "$libdir/postgis-1.4 new defect Normal ports
#26438 postgis documentation does not include images new defect Normal ports
#31248 Split PostGIS variants into separate ports new enhancement Normal ports
#32528 opencv @2.3.1a fixes and improvements: eigen, ffmpeg, docs, opengl, python, shared+static, tbb new enhancement Normal ports
#35088 OpenCV 2.4.1 has a bug on the pkg-config files new defect Normal ports
#35307 opencv @2.4.2 +universal configure failure: command execution failed new defect Normal ports
#35368 unable to build opencv with llvm-gcc-4.2 new defect Normal ports
#36696 py27-scikits-learn: Missing ATLAS symbol on sklearn.cluster import new defect Normal ports
#37022 py32-mahotas: ValueError in build_ext: underlying buffer has been detached new defect Normal ports
#37314 opencv @2.3.1: error: ‘av_open_input_file’ was not declared in this scope new defect Normal ports
#37627 py-pyproj is not UsingTheRightCompiler assigned defect Normal ports
#38168 Conflicting declarations in tiff and opencv new defect Normal ports
#38430 opencv: error: dispatch/dispatch.h: No such file or directory new defect Normal ports
#39671 orfeotoolbox : update python variant new enhancement Normal ports
#40078 py27-sympy build fails: AttributeError: 'module' object has no attribute 'sqrtrem' new defect Normal ports
#40344 libdynd: universal variant fails: error unknown calling convention new defect Normal ports
#40674 phantomjs @1.9.2 build error - Undefined symbols in QTWebFrame new defect Normal ports
#40994 phantomjs @1.9.2: library not found for -lQtWebKit new defect Normal ports
#41333 Add CUDA as a variant to OpenCV new enhancement Normal ports
#41541 py33-logilab-common installation failure new defect Normal ports
#41553 opencv @2.4.7_1 + enable cuda + configure error - build failure new defect Normal ports
#41750 py-mahotas and py-pymorph not available after install new defect Normal ports
#42102 py27-pip targets wrong python new defect Normal ports
#42163 libdynd @0.6.0: Install fails when previous version is active new defect Normal ports
#42368 phantomjs @1.9.7_0 build error - undefined symbols for achitecture x86_64 new defect Normal ports
#42432 phantomjs-1.9.7 - two build breaks + two ugly fixes new defect Normal ports
#42508 opencv @2.4.8 build fails new defect Normal ports
#42712 opencv 2.4.8_2 doesn't complete installation -DWITH_CUDA=ON on OS X 10.9.2 new defect Normal ports
#43188 py-theano: File permissions set incorrectly for egg-info new defect Normal ports
#43410 orfeotoolbox @4.0.0 +nonfree: conflicts with openjpeg15 but also depends on it new defect Normal ports
#43602 py27-astroid cant update new defect Normal ports
#44355 opencv @2.4.9 - build failure: Undefined symbols for architecture x86_64: "_main", referenced from: start in crt1.10.6.o (And probable fix) new defect Normal ports
#45240 py-Pillow @2.6.0 errors on OS X new defect Normal ports
#45682 add java variant to vtk port new enhancement Normal ports
#45804 py27-llvmmath @0.1.1_0: destroot fails with an assertion error new defect Normal ports
#45918 orfeotoolbox: update to 5.0.0 new update Normal ports
#46890 vtk @6.1.0 build fails on G4, Leopard new defect Normal ports
#46982 py27-numba: missing dependency "funcsigs" new defect Normal ports
#46983 py34-numba: basic example and unit tests fail new defect Normal ports
#47512 geos: add php and ruby capability new enhancement Normal ports
#47523 orfeotoolbox @4.0.0: CMake Error: The source directory ... does not appear to contain CMakeLists.txt. new defect Normal ports
#47549 opencv @2.4.11_0 - fails to load tiff files new defect Normal ports
#48066 opencv @3.0.0 fails to build if opencv @2.4.11 is active new defect Normal ports
#48218 opencv @3.0.0_0: debug variant not producing debug symbols new defect Normal ports
#48399 port install py27-kivy fails new defect Normal ports
#48408 py-Pillow @2.9.0 can use lcms2 new enhancement Normal ports
#48424 py34-gevent @1.0.2_0 is not really Python 3.4 compatible new defect Normal ports
#48455 opencv @3.0.0: error: use of undeclared identifier 'PTHREAD_RECURSIVE_MUTEX_INITIALIZER' reopened defect Normal ports
#48506 opencv @2.3.3 add +contrb variant for opencv_contrib repository new enhancement Normal ports
#48709 py-notebook: script to launch with jupyter is not created new defect Normal ports
#48725 py34-pip, pip_select: target "/opt/local/Library/Frameworks/Python.framework/Versions/3.4/bin/pip" doesn't exist new defect Normal ports
#48728 opencv 3.0: java wrappers are not generated for extra modules new defect Normal ports
#48750 notebook: incomplete support for MathJax new defect Normal ports
#49094 phantomjs 2.0 fails to build on OS X 10.11 El Capitan new defect Normal ports
#49289 opencv @3.0.0 | ffmpeg-devel @20150916_x- error: use of undeclared identifier 'avcodec_free_frame'; did you mean 'avcodec_get_name'? new defect Normal ports
#49670 OpenCV 2.x (please re-instate or provide a new opencv2 port) new enhancement Normal ports
#49869 theano.tensor.tests.test_slinalg.TestKron fails new defect Normal ports
#49942 Problem using IPython3 notebook new defect Normal ports
#50058 Executables installed by pip are not linked into macports path (and are not “select”able in any way). new enhancement Normal ports
#50608 py-jupyter: its subcommands are versioned, they should not new defect Normal ports
#50633 pyzo: new port request new request Normal ports
#50686 py-psutil 4.0.0 does not build on a PPC new defect Normal ports
#51435 orfeotoolbox new release new update Normal ports
#51529 Request select port for py-jupyter and subcommands new enhancement Normal ports
#51734 OpenCV needs patch to build with +vtk new defect Normal ports
#51829 opencv +vtk: Requested modules not available: vtkRenderingOpenGL new defect Normal ports
#53057 czmq will not build: upgrade to v4 or patch header file in 3.0.2 assigned defect Normal ports
#53126 opencv @3.1.0_8 +avx2 +contrib +eigen +gdal +opencl +java +python27 +python35 +qt5 +tbb fails to build assigned defect Normal ports
#53254 dask or scikit-image: add toolz as dependency? assigned defect Normal ports
#53374 Py-Pillow should have tkinter, and webp (or x11) variants assigned enhancement Normal ports
#53427 opencv build error on 10.9.5 assigned defect Normal ports
#53603 opencv @3.2.0: error: property 'activeVideoMaxFrameDuration' not found on object of type 'AVCaptureDevice *'; did you mean 'activeVideoMinFrameDuration'? assigned defect Normal ports
#53824 py35-cython: Python sandbox deny(1) file-write-create assigned defect Normal ports
#53964 py27-cryptography fails to build with libressl 2.5.3_0 assigned defect Normal ports
#54326 Unable to use sphinx to build documentation for py35-pip assigned defect Normal ports
#54468 problem installing py36-ipython on Mac OS Sierra 10.12.5 assigned defect Normal ports
#54484 opencv@2.4.10 +python27 build failure: 'QTKit/QTKit.h' file not found assigned defect Normal ports
#54519 py27-cryptography @2.0: error: -Werror=sign-conversion: No option -Wsign-conversion assigned defect Normal ports
#54534 py-widgetsnbextension: how to enable? assigned defect Normal ports
#54640 py27-cryptography @2.0.3 does not build on PPC Leopard, Mac OS X 10.5.8, because "Symbol not found: _PyUnicodeUCS2_FromObject" assigned defect Normal ports
#54675 py35-pandas @0.20.3_0: Missing extensions / problem importing numpy.core.multiarray assigned defect Normal ports
#55095 libgpuarray @0.7.5: Use a release download new enhancement Normal ports
#55523 opencv @3.2.0_1: Build failure with ffmpeg-devel @20171210 assigned defect Normal ports
#55525 py27-pynacl @1.2.1_1 does not build on PPC Leopard, Mac OS X 10.5.8, because Symbol not found: _PyUnicodeUCS2_FromObject assigned defect Normal ports
#55528 py27-cython @0.27.3 built on Mac OS X 10.5.8, Leopard, stops py27-cryptography, py27-pynacl, nghttp2 from building assigned defect Normal ports
#55737 Failed to configure opencv with +contrib variant assigned defect Normal ports
#55753 vtk needs tiff assigned defect Normal ports
#56078 py27-pip and PATH assigned defect Normal ports
#56105 phantomjs fails to build assigned defect Normal ports
#56284 py-llvmmath, py-llvmpy: depend on outdated clang-3.3 assigned defect Normal ports
#56401 py27-cryptography fails to build with libressl-devel 2.7.2 assigned defect Normal ports
#56411 opencv @3.4.1_2+contrib fails to build with protobuf-cpp assigned defect Normal ports
#56574 opencv @3.4.1: error: conversion from '<anonymous>::ufixedpoint16' to 'uint8_t' (aka 'unsigned char') is ambiguous assigned defect Normal ports
#56733 czmq: does not find zmq's pkg-config files assigned defect Normal ports
#56765 rocksdb @5.11.3: Update to 5.13.4 assigned update Normal ports
#56777 phantomjs fails to build assigned defect Normal ports
#57136 py-fabric: would it be possible to maintain a v1 and a v2 version of this port? assigned request Normal ports
#57191 leptonica @1.76.0 requires giflib 5 assigned defect Normal ports
1 2
Note: See TracQuery for help on using queries.