Custom Query (41 matches)

Filters
 
Or
 
  
 
Columns

Show under each result:


Ticket Summary Status Type Priority Milestone Component
#57609 cdo @1.9.5: error: could not determine ar interface assigned defect Normal ports
#60319 cdo @1.9.8: error: variable has incomplete type 'struct mach_task_basic_info' assigned defect Normal ports
#55798 eccodes +python27 variant assigned defect Normal ports
#53204 Error: Processing of port netcdf-fortran failed assigned defect Normal ports
#48270 esmf @6_3_0rp1: error: cannot allocate an object of abstract type 'xercesc_2_8::XMLGrammarPoolImpl' new defect Normal ports
#55138 Failed to build magicspp: command execution failed assigned defect Normal ports
#50295 fgsl fails to install new defect Normal ports
#54427 g95: configure error: 'CLOCK_REALTIME' undeclared (first use in this function) assigned defect Normal ports
#52686 gmt4 @4.5.14_2 : error building gmt4 during install assigned defect Normal ports
#56446 gmt5 @5.4.2 :debug:archivefetch Fetching archive failed: The requested URL returned error: 404 Not Found assigned defect Normal ports
#56363 gmt5 installation failure assigned defect Normal ports
#57479 gmt5: seems to link opportunistically to OpenBLAS assigned defect Normal ports
#48267 gnudatalange @0.9.5_4: dyld: Library not loaded: /opt/local/lib/libgrib_api.0.dylib new defect Normal ports
#41639 gnudatalanguage @0.9.4: error: call to 'isspace' is ambiguous new defect Normal ports
#49592 gnudatalanguage @0.9.5_8 + wxWidgets run error new defect Normal ports
#49530 gnudatalanguage @0.9.5: error: no member named 'width' in 'plstream' new defect Normal ports
#54040 gnudatalanguage @0.9.6_8 + wxWidgets run error assigned defect Normal ports
#47131 gnudatalanguage +python27 +openmp install fails with cmake issue. new defect Normal ports
#52947 grib_api @1.18.0_1 +gcc6: build using Xcode Clang instead of gcc6 assigned defect Normal ports
#58869 ispc @1.11.0: fatal error: 'type_traits' file not found assigned defect Normal ports
#60671 ispc-clang: use of undeclared identifier 'MAP_ANONYMOUS', 'CLOCK_MONOTONIC', 'CLOCK_REALTIME', 'clock_gettime' assigned defect Normal ports
#56043 libemos @2.4.2 cannot install the port assigned defect Normal ports
#40009 libproj4 @3_20081120_3+universal: arch mismatch with libgsl during build new defect Normal ports
#60950 lzw_codec: Version is commit hash assigned defect Normal ports
#52960 Magicspp python API shared object file not loadable by python assigned defect Normal ports
#53997 ncarg 6.4 el cap build fails assigned defect Normal ports
#57475 ncarg @6.5.0_2: Install fails, wrong hdf5 variant assigned defect Normal ports
#47056 nco/ncks and netcdf new defect Normal ports
#44608 netcdf @4.3.2 error: expected declaration specifiers or '...' before 'off_t' new defect Normal ports
#49198 netcdf @4.3.3.1_2 +dap +netcdf4 +gcc49/+gcc5 test fails new defect Normal ports
#51805 netcdf @4.4.1: error: cannot combine with previous 'type-name' declaration specifier new defect Normal ports
#52058 netcdf @4.4.1: error: redefinition of typedef ‘DCEparsestate’ new defect Normal ports
#59403 netcdf @4.7.0_1 configure failure assigned defect Normal ports
#54621 netcdf-fortran @4.4.4 does not include netcdf.mod assigned defect Normal ports
#55998 netcdf-fortran: Add clang variants assigned enhancement Normal ports
#39319 netcdf-fortran: NETCDF.mod install location varies with universal variant new defect Normal ports
#60813 plplot510: _pkg_check_modules_internal Macro invoked with incorrect arguments assigned defect Normal ports
#60840 [Port Abandoned] gmt5 (gmt6) assigned defect Normal ports
#42888 Upgrade of netcdf-fortran fails staging into destroot new defect Normal ports
#57466 upgrade outdated always rebuilds on hdfeos5 assigned defect Normal ports
#57156 wgrib2 fails to build on Mac OS X 10.11.6 assigned defect Normal ports
Note: See TracQuery for help on using queries.