New Ticket     Tickets     Wiki     Browse Source     Timeline     Roadmap     Ticket Reports     Search

Custom Query (4229 matches)

Filters
 
Or
 
  
 
Columns

Show under each result:


Results (901 - 1000 of 4229)

1 2 3 4 5 6 7 8 9 10 11 12 13 14 15 16 17 18 19 20
Ticket Summary Status Owner Type Priority Milestone
#38513 maloc @1.5: make documentation into a variant new macports-tickets@… defect Normal
#38515 monotone @1.0.0 build failure new macports-tickets@… defect Normal
#38519 blitz-devel @0.10-20110812_1: build failure new andre.dos.anjos@… defect Normal
#38525 poppler @0.22.2: fix conflict between docs and universal variant new devans@… defect Normal
#38547 supertuxkart: fatal error: 'AGL/gl.h' file not found new macports-tickets@… defect Normal
#38548 qtmobility does not compile new macports-tickets@… defect Normal
#38549 Trac RSS Feed Broken new admin@… defect Normal
#38551 gcc48: "ar" does not work (complains about missing 'liblto_plugin.so') new mww@… defect Normal
#38558 VirtualBox @4.2.10 build fails when poll-emulator @1.5.1 is active new macports-tickets@… defect Normal
#38560 opencv +python27: cannot import Python module new macports-tickets@… defect Normal
#38561 openssl @1.0.1_1 build failure on Tiger (again) no-asm for Dawin 8? new larryv@… defect Normal
#38566 rawstudio: error: gdk/gdkx.h: No such file or directory new macports-tickets@… defect Normal
#38586 atlas @3.10.1_3: log file contents missing when -k option used new macports-tickets@… defect Normal
#38617 gtk2: pkg-config --libs gtk+-2.0 does not include -lgmodule-2.0 new macports-tickets@… defect Normal
#38624 Ogre build fails new marin.saric@… defect Normal
#38627 oracle-instantclient: not available on ppc machines new ryandesign@… defect Normal
#38629 openldap: clang: error: no input files new landonf@… defect Normal
#38639 samba4 fails to build new mww@… defect Normal
#38688 plplot build error reopened takeshi@… defect Normal
#38697 mdmg says it's up-to-date when it isn't new macports-tickets@… defect Normal
#38709 maxima @5.28.0_3+xmaxima binary package is inevitably obsolete new macports-tickets@… defect Normal
#38710 elinks-devel: +gnutls variant build fails new macports-tickets@… defect Normal
#38715 unittest-cpp fails to build new macports-tickets@… defect Normal
#38716 stp fails to build new macports-tickets@… defect Normal
#38746 no action from MacPorts IDLE new jwa@… defect Normal
#38753 metapixel 1.0.2_3 does not build with libpng 1.5 new fclaire@… defect Normal
#38789 totem fails to build on a case-sensitive filesystem new devans@… defect Normal
#38793 gmime @2.6.15_0 build failure due to missing dependency new macports-tickets@… defect Normal
#38806 cmake +universal cannot be installed with universal_archs='i386 ppc' new michaelld@… defect Low
#38825 gtkglextmm @1.2.0: fix underquoted macro warning new billitch@… defect Normal
#38829 Nagios should use a separate group for the "command group" new macports-tickets@… defect Normal
#38838 Cannot add .qch files to QtCreator new macports-tickets@… defect Normal
#38878 gettext: Use macports libtool and thus support compilation against libc++ new ryandesign@… defect Normal
#38884 openssl @1.0.1e_1+universal DTLS handshake error messages with openconnect new larryv@… defect Low
#38885 cufflinks @ 0.9.3: build fails new haroldpimentel@… defect Normal
#38910 pear-PHPUnit @3.6.11: configure error new macports-tickets@… defect Normal
#38911 Error Building Nu new macports-tickets@… defect Normal
#38942 zlib @1.2.8: mpkg failure new ryandesign@… defect Normal
#38948 Cannot use port select bpython with bpython_select new macports-tickets@… defect Normal
#38951 rdesktop +smartcard: Undefined symbols: "_SCARD_CTL_CODE" new cshbell@… defect Normal
#38958 R @3.0.0_0: build failure on OS X 10.6.8 new kjell.konis@… defect Normal
#38969 cufflinks @0.9.3 - build failure new haroldpimentel@… defect Normal
#38973 Error: Failed to install gnome-doc-utils while installing wine new macports-tickets@… defect Normal
#38979 gtkmm 2.24.3_1: build failure on 10.5.8 new devans@… defect Normal
#38986 python 2.7 ENOTSUP vs. EOPNOTSUPP discrepancies new jwa@… defect Normal
#38991 Python27 crashes in openssl code on PPC Tiger 10.4.11 when I build with -vd new macports-tickets@… defect Normal
#39025 mtools @3.9.11 needs a dependency on xorg-libx11 new francois@… defect Normal
#39026 bigloo links to nonexisting framework new macports-tickets@… defect Normal
#39032 libnotify @0.5.2 should use the active_variants portgroup new macports-tickets@… defect Normal
#39038 ccl-util @32.69: build error new dave@… defect Normal
#39044 python33 @3.3.1: build failure new jwa@… defect Normal
#39051 The example portfile in the "doc" folder of base should pass lint new macports-tickets@… defect Normal
#39070 uzbl: uzbl-browser immediately aborts with a memory fault assigned ryandesign@… defect Normal
#39074 mod_security2 fails to compile with lua error new pixilla@… defect Normal
#39098 opendx @4.4.4_3: mkdir: /opt/local/dx/java/server/nets: Operation not permitted new macports-tickets@… defect Normal
#39100 aria2 @1.17.0 build error related to AppleTLSContext.cc; build failure new macports-tickets@… defect Normal
#39111 gnumeric won't install new macports-tickets@… defect Normal
#39123 squid3: EUI error with 3.3.4 and OSX Server 10.6.8 assigned jmr@… defect Normal
#39124 povray 3.7.0.RC7 does not support Preview_Start_Size new macports-tickets@… defect Normal
#39125 ImageMagick 6.8.5-5: build failure new ryandesign@… defect Normal
#39136 make test fails when run as root and creates junk file new macports-tickets@… defect Normal
#39151 cflow 1.0 Build error with clang new gnn@… defect Normal
#39153 Kdevelop will not launch after successful installation reopened nicos@… defect Normal
#39172 poppler 0.22.4 seems to miss a dependency: source-highlight new devans@… defect Normal
#39174 gimp-jp2 needs to be aware whether it was compiled against gtk2 +x11 or +quartz new devans@… defect Normal
#39192 Image::LibRSVG won't install new pixilla@… defect Normal
#39209 afni @2010_10_19_1028_2: checksum mismatch new macports-tickets@… defect Normal
#39248 rb ports need revbump assigned kimuraw@… defect High
#39249 qt3-mac: error: invalid use of incomplete type ‘struct png_info_def’ new blair@… defect Normal
#39265 graphviz +ruby: mtree violation by /System new ryandesign@… defect Normal
#39272 `-p` flag for `port` command doesn't play nice with errors resulting from mismatched requested variants vs. originally-selected variants new macports-tickets@… defect Normal
#39299 libpqxx26 build fails with clang due to -Werror new macports-tickets@… defect Normal
#39300 libpqxx26 conflicts with libpqxx new macports-tickets@… defect Normal
#39303 avahi @0.6.31 fails to upgrade to revision 8 new pixilla@… defect Normal
#39307 mplayer no subtitles, no fonts new jeremyhu@… defect Normal
#39312 gtkglextmm 1.2.0 - command execution failed new billitch@… defect Normal
#39319 netcdf-fortran: NETCDF.mod install location varies with universal variant new takeshi@… defect Normal
#39332 quarter @1.0.0.5 +Coin error -build failure new macports-tickets@… defect Normal
#39339 R-app @1.61: build failure on 10.6.8 new kjell.konis@… defect Normal
#39344 evas 1.7.7 build failure new ryandesign@… defect Normal
#39345 spim @7.4 build failed - Command execution failed new macports-tickets@… defect Normal
#39346 kerberos5: build failure (10.4/Intel) new ryandesign@… defect Normal
#39347 Qt-Creator doesn't open any pro file anymore new sicherha@… defect Normal
#39372 xournal: copy and paste don't work new ryandesign@… defect Normal
#39403 kgraphviewer @2.1.1_0: build failure - package 'libgraph' not found new jonesc@… defect Normal
#39405 Space character in packagemaker_path attribute in macports.conf breaks mpkg and mdmg new macports-tickets@… defect Normal
#39416 Error: org.macports.build for port arm-elf-gdb returned: command execution failed new billy@… defect Normal
#39420 imapfilter @2.5.3: "symbol not found _lual_register" at runtime new mww@… defect Normal
#39423 Uninstalling replaced port with dependents has to be forced new macports-tickets@… defect Normal
#39464 db_select @0.1 Failed to fetch signature for archive - build failure new macports-tickets@… defect Normal
#39467 rb-capistrano does not install capistrano in any useful form new macports-tickets@… defect Normal
#39484 man @@1.6g +man_all_lang build failure new mww@… defect Normal
#39522 "man" incorrectly displays the Russian locale new macports-tickets@… defect Normal
#39527 logsentry - Fix path references new julien.touche@… defect Normal
#39538 wireshark @1.10.0_1: Install ws_symbol_export.h new darkart.com@… defect Normal
#39541 gimp2 @2.8.6_0 +help_browser +python27 +quartz build fails assigned devans@… defect Normal
#39559 openscad build fails: fatal error: 'IOKit/IOKitLib.h' file not found new macports-tickets@… defect Normal
#39561 postgresql93-server @9.3beta2: Unable to start server new jwa@… defect Normal
#39571 yelp 2.31.6 fails to build for +quartz new macports-tickets@… defect Normal
#39586 vtk5 @5.10.1_0 new macports-tickets@… defect Normal
1 2 3 4 5 6 7 8 9 10 11 12 13 14 15 16 17 18 19 20
Note: See TracQuery for help on using queries.