New Ticket     Tickets     Wiki     Browse Source     Timeline     Roadmap     Ticket Reports     Search

Custom Query (4235 matches)

Filters
 
Or
 
  
 
Columns

Show under each result:


Results (1001 - 1100 of 4235)

1 2 3 4 5 6 7 8 9 10 11 12 13 14 15 16 17 18 19 20 21
Ticket Summary Status Owner Type Priority Milestone
#33491 Save binary packages to user-specified location new macports-tickets@… enhancement Normal
#33495 py-ldap: Update python-ldap to 2.4.8 new macports-tickets@… update Normal
#33522 tovid package does not currently work new macports-tickets@… defect Normal
#33545 bullet: The following variables are used in this project, but they are set to NOTFOUND: OPENCL_LIBRARY new stromnov@… defect Normal
#33561 gcc48: Selecting 'mp-gcc48' for 'gcc' failed ... gcj": target new mww@… defect Normal
#33613 criticalmass: memalloc errors new macports-tickets@… defect Normal
#33629 port -e, environment mode new macports-tickets@… enhancement Normal
#33647 perl p5 ports: 5.12.3: no such file or directory new macports-tickets@… defect Normal
#33658 gcc47 @4.7-20120225 on 10.5.8 PPC - internal compiler error new mww@… defect Normal
#33673 libpqxx: tests don't work new macports-tickets@… defect Normal
#33684 autogen 5.15 fails shell.hlp test case on case-insensitive filesystems new mww@… defect Normal
#33693 p5-mytop: update to 1.7 assigned ryandesign@… update Normal
#33696 ffmpeg: Cannot build with XCode 4.3.1 for 64 bit new devans@… defect Normal
#33697 Incomplete uninstall script new macports-tickets@… defect Normal
#33701 LyX spotlight plugin can't be loaded new khindenburg@… defect Normal
#33708 cuneiform @1.1.0_0 Error during execution: Abort trap: 6 new macports-tickets@… defect Normal
#33714 Awesome @3.4.11: cannot find default config new macports-tickets@… defect Normal
#33719 keep machines from sleep during port building new macports-tickets@… enhancement Normal MacPorts Future
#33720 Cannot use non-ascii in the Python interactive shell new macports-tickets@… defect Normal
#33732 ccl 1.7.1 fails to compile on darwin 9.8.0 new easieste@… defect Normal
#33755 request: bluegriffon new macports-tickets@… request Normal
#33757 ipe @7.1.2 (graphics); build fails on image.o new m.thon@… defect Normal
#33766 cherokee: universal variant fails new michael@… defect Normal
#33767 cherokee links with libraries it doesn't declare dependencies on new michael@… defect Normal
#33768 cherokee shouldn't use negatively-named variants new michael@… enhancement Normal
#33771 libnoise @1.0.0 submission new macports-tickets@… submission Normal
#33772 texinfo: cannot display the flex documentation new macports-tickets@… defect Normal
#33774 ejabberd doesn't support odbc new ciserlohn@… enhancement Normal
#33788 exact-image looks for X11 in /usr/X11 new macports@… defect Normal
#33792 libbonobo: ../idl/Bonobo.idl compilation failed new macports-tickets@… defect Normal
#33802 gtk2 build failure on 10.8: incomplete definition of type 'struct _ipp_s' new macports-tickets@… defect Normal
#33816 Port Request: Perl DateTime::Format::ICal new macports-tickets@… submission Normal
#33820 base: add ui_msg to output outdated ports during selfupdate new macports-tickets@… enhancement Normal
#33827 cairo: Undefined symbols _cairo_boilerplate_get_target_by_name _cairo_boilerplate_xrealloc _cairo_boilerplate_xmalloc, and links with libraries it doesn't declare dependencies on reopened ryandesign@… defect Normal
#33830 evince and gv both fail to display PostScript correctly new macports-tickets@… defect Normal
#33831 binutils: gnm reports negative symbol sizes new macports-tickets@… defect Normal
#33857 InsightToolkit: error: use of undeclared identifier 'equal' new macports-tickets@… defect Normal
#33859 p5.12-gtk2 does not compile on MacOS X Lion new macports-tickets@… defect Normal
#33860 sword: error: use of undeclared identifier 'find' new macports-tickets@… defect Normal
#33871 New port: luabind new macports-tickets@… submission Normal
#33886 Startx script cannot handle fake domain names on PPC Tiger? new macports-tickets@… defect Normal
#33890 base: add default compiler variants new macports-tickets@… enhancement Normal
#33927 Add CELT051 audio codec to ports new macports-tickets@… submission Normal
#33930 Ignore consequences of broken DNS servers reopened ryandesign@… defect Normal
#33932 Erroneous "Missing subversion property on Portfile" error new macports-tickets@… defect Normal
#33933 Remove "port -u uninstall" functionality new macports-tickets@… enhancement Normal
#33989 VTK: error: 'strcmp' was not declared in this scope new css@… defect Normal
#33998 no kdepim4 application work. new macports-tickets@… defect Normal
#34012 openal: error: 'CAStreamBasicDescription.h' file not found new macports-tickets@… defect Normal
#34040 py**-gobject: annoying startup warnings reopened macports-tickets@… defect Normal
#34061 Add Vision Workbench Port new macports-tickets@… submission Normal
#34063 pear-XML_Util- installer/bin/pear: No such file or directory new pixilla@… defect Normal
#34067 New port: py-pykml new macports-tickets@… submission Normal
#34068 New port: py-pymysql new macports-tickets@… submission Normal
#34069 New port: py-suelta new macports-tickets@… submission Normal
#34071 New port: py-sleekxmpp new macports-tickets@… submission Normal
#34085 Add Ames Stereo Pipeline Port new macports-tickets@… submission Normal
#34094 ffmpeg: patch required to solve undefined type/function when using C++ new devans@… enhancement Normal
#34098 Cairo Build Issue new ryandesign@… defect Normal
#34124 openal: update to latest version new macports-tickets@… defect Normal
#34129 groff @1.21_2 build failure: "fatal error: invalid device `html'" new macports-tickets@… defect Normal
#34130 subversion: mod_dav_svn subport new dluke@… enhancement Normal
#34143 ocaml-ocamlnet : all variants available in configure new landonf@… enhancement Normal
#34177 port mpkg does no arch checking new macports-tickets@… defect Normal MacPorts Future
#34183 gst-plugins-ugly @0.10.19_2 missing headers new macports-tickets@… defect Normal
#34186 evince @2.30.3 configure failure: "PDF support is disabled since poppler-glib library version 0.12.0 or newer not found" new devans@… defect Normal
#34199 request: relayd port new macports-tickets@… request Normal
#34212 liblrdf compilation problems new pixilla@… defect Normal
#34215 gst-plugins-base @0.10.36_1 +universal destroot failure new macports-tickets@… defect Normal
#34216 updated routes, added repoze.lru new macports-tickets@… submission Normal
#34224 n2n: subversion check out failed, certificate issued for a different hostname new msmk@… defect Normal
#34228 php5: fsockopen don't work since php 5.3.10, with openssl 1.0.1b_0 new ryandesign@… defect Normal
#34231 ImageMagick: should not depend on pango + fix openMP new ryandesign@… defect Normal
#34256 tex-whizzytex @1.3.1 Configure failure: "Cannot run initex with any of the formats: latex latex" new macports-tickets@… defect Normal
#34264 digikam: Undefined symbols for architecture x86_64 new jan@… defect Normal
#34271 python27 2.7.3_0 py27-gtk 2.22.0_1 etc -- pkg-config files not installed correctly for python 2.6 and 2.7 versions of pygtk and pygobject new macports-tickets@… defect Normal
#34289 ffmpeg-devel: add qt-faststart new devans@… enhancement Normal
#34305 VTK: error: ‘FSSpec’ has no member named ‘name’ new css@… defect Normal
#34308 pkgconfig: Undefined symbols new ryandesign@… defect Normal
#34316 yorick @2.2.02: use the right compiler assigned thibaut@… enhancement Normal
#34319 New Port: jzmq; Java Bindings for zmq (Zero Message Queue) new macports-tickets@… submission Normal
#34325 Port Request: rb19-cloudapp new macports-tickets@… request Normal
#34383 curl @7.25.0 SFTP fails with "Failure establishing ssh session" (2) new ryandesign@… defect Normal
#34389 strategoxt fails to install new macports-tickets@… defect Normal
#34403 rpm activation fails on buildbot: __init__.py already exists reopened afb@… defect Normal
#34412 apt will not compile at the end new landonf@… defect Normal
#34415 dbus-devel: build fails new pixilla@… defect Normal
#34417 nu2: fatal error: 'Foundation/Foundation.h' file not found new macports-tickets@… defect Normal
#34427 playerstage-player: build uses /Library/Frameworks/Python.framework, fails new vincent@… defect Normal
#34447 freeciv 2.3.2 not compiling with global variants set to -x11 +no_x11 new macports-tickets@… defect Normal
#34470 xgraph segmentation fault assigned ryandesign@… defect Normal
#34497 "Universal" variant in gccXX ports should be changed to some other name new mww@… enhancement Normal
#34502 ogre@1.7.3 - pbxcp command execution failed, build failed. assigned marin@… defect Normal
#34538 Soprano 2.7.4 fails to build with wrong-arch iodbc.framework in /Library/Frameworks new pixilla@… defect Normal
#34539 ophcrack: add fast and small variants new macports-tickets@… defect Normal
#34548 dansguardian doesn't start anymore since upgrade to macports 2.1.0 new macports-tickets@… defect Normal
#34551 python31, python32: Make Framework creation optional new macports-tickets@… enhancement Normal
#34560 php5-spidermonkey 1.0.0 new franck.cassedanne@… update Normal
#34566 unison: uigtk2.cmx and /opt/local/lib/ocaml/lablgtk2/lablgtk.cmxa make inconsistent assumptions over implementation GtkSignal new macports-tickets@… defect Normal
#34572 samba3 @3.6.5 fails to initialize on startup new macports-tickets@… defect Normal
1 2 3 4 5 6 7 8 9 10 11 12 13 14 15 16 17 18 19 20 21
Note: See TracQuery for help on using queries.