New Ticket     Tickets     Wiki     Browse Source     Timeline     Roadmap     Ticket Reports     Search

Custom Query (3805 matches)

Filters
 
Or
 
  
 
Columns

Show under each result:


Results (2501 - 2600 of 3805)

Ticket Summary Status Owner Type Priority Milestone
#42430 TexShop @2.47 Build error: Unsupported compiler 'gcc' selected for architecture 'i386' new macports-tickets@… defect Normal
#42432 phantomjs-1.9.7 - two build breaks + two ugly fixes new stromnov@… defect Normal
#42447 Wireshark application request new opendarwin.org@… enhancement Normal
#42457 [update] volatility 2.3.1 new macports-tickets@… update Normal
#42459 zeroc-ice34-java, installation fails new blair@… defect Normal
#42463 gd2: destroot: file already exists new ryandesign@… defect Normal
#42475 sdf2-bundle compilation failure new macports-tickets@… defect Normal
#42480 strategoxt build failure - needs to link libErrorAPI? new macports-tickets@… defect Normal
#42482 argus: looking for plugins in '/usr/lib64/sasl2', failed to open directory, error: new macports-tickets@… defect Normal
#42484 Spam tickets new skarulkar@… defect Normal
#42489 mono-addins failed to compile new macports-tickets@… defect Normal
#42497 boost +universal fails with "bad register name" over a million times new macports-tickets@… defect Normal
#42506 sparsehash: configuration error new hum@… defect Normal
#42508 opencv @2.4.8 build fails new stromnov@… defect Normal
#42512 Tkinter not working with macports-installed pypy new jmr@… defect Normal
#42518 arm-rtems-gcc does not build new macports-tickets@… defect Normal
#42519 klayout submission new macports-tickets@… submission Normal
#42529 gst @3.1_4: build error (abort trap) new saispo@… defect Normal
#42530 atlas does not recognize gcc49 gfortran new vince@… defect Normal
#42533 [NEW] ossec new macports-tickets@… submission Normal
#42535 [NEW] samhain new macports-tickets@… submission Normal
#42536 [NEW] ossim new macports-tickets@… submission Normal
#42537 [NEW] xplico new macports-tickets@… submission Normal
#42538 [NEW] silk new macports-tickets@… submission Normal
#42541 NCAR graphics fails to build reopened takeshi@… defect Normal
#42544 glimpse: error: non-void function 'sorted_union' should return a value new macports-tickets@… defect Normal
#42552 New port: mp3cat new macports-tickets@… submission Normal
#42555 Librecad install fails, cannot find boost. new macports-tickets@… defect Normal
#42558 gnome-settings-daemon fails to build with gtk3 +quartz -x11 new devans@… defect Normal
#42581 stow @2.2.0_0 Bad installation path for perl module new macports-tickets@… defect Normal
#42582 p5-libapreq2: fails to build for any perl version except the default one (Can't locate ModPerl/MM.pm) new macports-tickets@… defect Normal
#42590 gnubg @0.14.3_5: build error "assignment to cast is illegal, lvalue casts are not supported" new macports-tickets@… defect Normal
#42600 new port: python/py-scard 1.6.12 new macports-tickets@… submission Normal
#42608 New port for fxload new macports-tickets@… submission Normal
#42615 arm-none-linux-gnueabi-gcc build failure new stuartwesterman@… defect Normal
#42625 h5utils can't find libpng new macports-tickets@… defect Normal
#42630 avahi @0.6.31_12: fails to configure new macports-tickets@… defect Normal
#42639 ott: Files types.cmx and location.cmx make inconsistent assumptions over interface Location new ggreif@… defect Normal
#42640 gnokii @ 0.6.31 - build failures new mpal1+bugzilla@… defect Normal
#42641 Need ARM Linux gnueabi Cross Compiler new macports-tickets@… request Normal
#42651 fdupes @1.51: error: invalid lvalue in assignment new macports-tickets@… defect Normal
#42656 kerberos5: error: 'decomp' may be used uninitialized in this function new macports-tickets@… defect Normal
#42660 gcalcli 3.1 in an new port new macports-tickets@… request Normal
#42662 gvpe @2.22: update to 2.25 new macports-tickets@… update Normal
#42665 radare2 @0.9.6: error: unknown type name 'uint32_t' new g5pw@… defect Normal
#42670 radare2: universal variant fails new g5pw@… defect Normal
#42673 kde4-baseapps build failure on OS X 10.6.8 new nicos@… defect Normal
#42678 [NEW] ossec-wui 0.8 new macports-tickets@… submission Normal
#42681 [NEW] libevtx new macports-tickets@… submission Normal
#42682 [NEW] liblnk new macports-tickets@… submission Normal
#42683 [NEW] libvshadow new macports-tickets@… submission Normal
#42684 [NEW] libregf new macports-tickets@… submission Normal
#42685 [NEW] libmsiecf new macports-tickets@… submission Normal
#42686 [NEW] libolecf new macports-tickets@… submission Normal
#42687 [NEW] libewf new macports-tickets@… submission Normal
#42688 [NEW] libqcow new macports-tickets@… submission Normal
#42689 [NEW] libvhdi new macports-tickets@… submission Normal
#42690 [NEW] dfvfs new macports-tickets@… submission Normal
#42691 [NEW] beltane new macports-tickets@… submission Normal
#42692 [NEW] grr new macports-tickets@… submission Normal
#42693 [NEW] py-pyinstaller new macports-tickets@… submission Normal
#42694 [NEW] simplerisk new macports-tickets@… submission Normal
#42695 Updating thrift-devel to use March 1 master branch from git repository. new blair@… update Normal
#42697 [NEW] py-adns new macports-tickets@… submission Normal
#42698 [NEW] py-cymruservices new macports-tickets@… submission Normal
#42702 glibtool drops dylibs at link time new macports-tickets@… defect Normal
#42703 FontForge builds + fails to find MacPorts X11 at runtime new macports-tickets@… defect Normal
#42712 opencv 2.4.8_2 doesn't complete installation -DWITH_CUDA=ON on OS X 10.9.2 new stromnov@… defect Normal
#42720 Port Request: Mathics new macports-tickets@… request Normal
#42725 'port pkg' still requires PackageMaker.app new macports-tickets@… defect Normal
#42728 autogen @5.17.4_0: autoopts-config produces a stray -R flag, breaks gnutls @3.1.22_0 build new mww@… defect Normal
#42729 uzbl: seg fault when running uzbl-browser new ryandesign@… defect Normal
#42731 RFE: Add a conf option to automatically run test phase during normal install process new macports-tickets@… enhancement Normal
#42732 mpfr @3.1.1-p2: test suite fails on x86_64 Snow Leopard (when run with `port test gmp mpfr libmpc`) new macports-tickets@… defect Normal
#42733 libmpc @1.0.2: testsuite fails new macports-tickets@… defect Normal
#42739 zenity on Maverics errors with GTK-warning cannot open display new macports-tickets@… defect Normal
#42743 build error "invalid output constraint '=o'" for mplayer-devel with clang new jeremyhu@… defect Normal
#42749 autogen: update to 5.18.3 new mww@… update Normal
#42760 icewm fails to build - fix included new saispo@… defect Normal
#42767 Commit email shows property changes incorrectly new wsiegrist@… defect Normal
#42776 NEW: hplip @3.14.1 new macports-tickets@… submission Normal
#42777 gcc47/gcc48 - problem with linking some C++ python extensions (std::ostringstream) new mww@… defect Normal
#42779 asn1c @0.9.24 compile fails due to missing symbols on Snow Leopard new macports-tickets@… defect Normal
#42785 db46: error: no member named 'seq' in 'struct __db' reopened macports-tickets@… defect Normal
#42790 atlas fail to install new vince@… defect Normal
#42792 py27-python-daemon @1.5.5: missing dependency new macports-tickets@… defect Normal
#42802 gtkglextmm 1.2.0 command execution failed new billitch@… defect Normal
#42810 atlas @3.10.1_5: fails to to build with `+perf` variant new vince@… defect Normal
#42830 VC (Vector Classes) new macports-tickets@… request Normal
#42854 adodb update to 5.18a new macports-tickets@… update Normal
#42856 bro: improvements to portfile new tanawts@… enhancement Normal
#42858 [NEW] suricata 1.4.7 new macports-tickets@… submission Normal
#42859 [NEW] oinkmaster new pixilla@… submission Normal
#42861 Guide for replacing system ssh with MacPorts ssh new macports-tickets@… enhancement Normal
#42868 unable to build/install arm-none-linux-gnueabi-gcc new stuartwesterman@… defect Normal
#42872 cmake PortGroup: don't add -I${prefix}/include to CXXFLAGS new macports-tickets@… defect Normal
#42876 Stack overflow in Gnucash when opening the Scheduled Transactions Editor assigned dports@… defect Normal
#42880 oracle-instantclient: don't create oradiag_username directory assigned ryandesign@… enhancement Normal
#42888 Upgrade of netcdf-fortran fails staging into destroot new takeshi@… defect Normal
#42895 New port: zmap new macports-tickets@… submission Normal
Note: See TracQuery for help on using queries.