New Ticket     Tickets     Wiki     Browse Source     Timeline     Roadmap     Ticket Reports     Search

Custom Query (3811 matches)

Filters
 
Or
 
  
 
Columns

Show under each result:


Results (2501 - 2600 of 3811)

Ticket Summary Status Owner Type Priority Milestone
#42008 cssed: ld: symbol(s) not found for architecture x86_64 new macports-tickets@… defect Normal
#42011 perl5.12: error: Availability.h: No such file or directory new macports-tickets@… defect Normal
#42014 gjs build failure new juanrgar@… defect Normal
#42024 rdiff-backup-fs @1.0.0 new port new macports-tickets@… submission Normal
#42029 qt4-mac: Undefined symbols _dbus_shutdown new michaelld@… defect Normal
#42030 alliance @5.0: error: incompatible type for argument 2 of 'chktab' new macports-tickets@… defect Normal
#42035 gnome-utils: port outdated, replaced by new individual GNOME packages, maintainers wanted. new macports-tickets@… request Normal
#42037 gnome-games: port outdated, replaced by new individual GNOME packages, maintainers wanted. new macports-tickets@… defect Normal
#42045 cgminer @3.9.0 knc varient causes compilation error new ram@… defect Normal
#42051 llvm-3.3: found python 2.3.5 (/usr/bin/python); required >= 2.5 new ryandesign@… defect Normal
#42055 freeradius @2.1.9_2 - Update overwrites all config files new macports-tickets@… defect Normal
#42061 mysql5: uses /usr/lib/libstdc++.6.dylib as C++ standard library although macports::cxx_stdlib is set to libc++ new ryandesign@… defect Normal
#42064 py-pil @1.1.7_7 Add +tk variant to allow for no-x11 builds new jmr@… enhancement Normal
#42065 Squid runaway child processes at boot, commBind: Cannot bind socket FD NN to *:3128: (48) Address already in use new jmr@… defect Normal
#42066 libplist @1.10: add python34 variants new macports-tickets@… enhancement Normal
#42070 lua @5.2.2_1 arrow keys don't work in interpreter new macports-tickets@… defect Normal
#42071 mesa @8.0.4: add python32 and python33 variants new jeremyhu@… enhancement Normal
#42089 Request for Skia new macports-tickets@… request Normal
#42092 ghc-bootstrap does not build new kitchen.andy@… defect Normal
#42100 arpack 3.1.3_0+accelerate+gcc48+universal: i386 configure cannot find BLAS new mmoll@… defect Normal
#42101 upgrading qpdf attempts to link with old library new dojo@… defect Normal
#42102 py27-pip targets wrong python new stromnov@… defect Normal
#42105 fop and other java ports should check for JVM on activation new macports-tickets@… defect Normal
#42114 maven-devel: fix select, livecheck and remove conflict with maven3 new easieste@… enhancement Normal
#42120 cufflinks: update to 2.1.1 new haroldpimentel@… update Normal
#42123 Cannot install Atlas new vince@… defect Normal
#42124 libcaca should not depend on port:imlib2 new macports-tickets@… defect Normal
#42125 Can't install traceroute new macports-tickets@… defect Normal
#42128 [NEW] Firebird 2.5 Portfile, still problem compiling new macports-tickets@… submission Normal
#42129 [NEW] lsyncd new macports-tickets@… submission Normal
#42130 invalid command name "configure.cxx_stdlib" new macports-tickets@… defect Normal
#42139 subversion-devel: request for a new subport new blair@… submission Normal
#42149 mpeg4ip @1.5.0.1_3 does not compile on Mavericks new reid@… defect Normal
#42150 Aqua applications not compiling on Mavericks / Xcode 5.0.2 (ibtool error) new macports-tickets@… defect Normal
#42161 grass: compatibility with wxWidgets 3.0 new macports-tickets@… defect Normal
#42163 Upgrade or install of libdynd fails new stromnov@… defect Normal
#42165 dialog @1.2-20130928+universal∞ Install failed during build new macports-tickets@… defect Normal
#42191 python*: IDLE requires py*-tkinter new jwa@… defect Normal
#42194 Undefined symbols upgrading qpdf on Lion new dojo@… defect Normal
#42202 py-cython multiple upstream versions of Cython-9.20.tar.gz new macports-tickets@… defect Normal
#42203 grass: allow building without GUI new macports-tickets@… enhancement Normal
#42205 new rstudio-server Portfile new macports-tickets@… submission Normal
#42207 uninstalling macports could be easier new macports-tickets@… enhancement Normal
#42220 py-netcdf4 @1.0.4_1: build failure when using ccache new macports-tickets@… defect Normal
#42225 qemu crashes in OpenSSL on Leopard/PPC new macports-tickets@… defect Normal
#42231 xtide @2.13.2_1: error: no type named 'initializer_list' in namespace 'std' new macports-tickets@… defect Normal
#42232 gdal @1.10.1_2 +expat +mrsid - patch failure - build failure new macports-tickets@… defect Normal
#42233 libraries compiled by the boost port with variant +python33 do not have match the symbols of regular builds new macports-tickets@… defect Normal
#42239 hnb @1.9.18_0 Segmentation fault 11 new css@… defect Normal
#42251 Portfile for LibreCAD new macports-tickets@… enhancement Normal
#42261 py27-backports-ssl_match_hostname install failure new stromnov@… defect Normal
#42264 airport fails to build on Mavericks new noses@… defect Normal
#42286 wxMaxima: greyed-out menu entries new usami-k@… defect Normal
#42289 librsvg @2.36.4_3 fails to update /opt/local/etc/gtk-2.0/gdk-pixbuf.loaders new pixilla@… defect Normal
#42294 toluapp @1.0.93_1 +universal: build failure new macports-tickets@… defect Normal
#42303 Use waf port group new macports-tickets@… defect Normal
#42320 py-bottleneck @0.8.0 unbuildable on small machines new stromnov@… defect Normal
#42331 crack-attack won't build/install on OS X Mavericks new raimue@… defect Normal
#42334 emacs @24.3_1+gtk+x11 error in g_spawn_sync() - emacs bug #8855 new dports@… defect Normal
#42336 heimdal @1.3.3_1 does not install (OS 10.9) new landonf@… defect Normal
#42338 nss: add universal variant new macports-tickets@… enhancement Normal
#42344 new composer port request new macports-tickets@… request Normal
#42353 iulib: error: default arguments cannot be added to a function template that has already been declared new macports-tickets@… defect Normal
#42361 libjpeg-turbo +universal: build failure new macports-tickets@… defect Normal
#42368 phantomjs @1.9.7_0 build error - undefined symbols for achitecture x86_64 new stromnov@… defect Normal
#42370 slib: build fails with texinfo 5 new macports-tickets@… defect Normal
#42375 i386-elf-gcc error while compiling: cannot find crt0.o new stepan@… defect Normal
#42379 john-jumbo new macports-tickets@… enhancement Normal
#42382 py-pdfminer for Py3 new eborisch@… enhancement Normal
#42394 [NEW] plaso new macports-tickets@… submission Normal
#42395 ghostscript cannot find fonts (such as Times) new takanori@… defect Normal
#42396 Install Java on Mavericks buildslave new skarulkar@… enhancement Normal
#42397 GoAccess submission new macports-tickets@… submission Normal
#42398 itk Build Fails new macports-tickets@… defect Normal
#42401 Dia does not include help documentation; offers no variant to build it either new macports-tickets@… enhancement Normal
#42404 Problems installing atlas new vince@… defect Normal
#42405 Can't find or open Potrace and Autotrace new macports-tickets@… defect Normal
#42416 py*-numpy @1.8.0_2+universal: C libraries are not universal new michaelld@… defect Normal
#42426 db46 build failed new blair@… defect Normal
#42428 Aquaterm fails to build due to StripNIB failures new g5pw@… defect Normal
#42430 TexShop @2.47 Build error: Unsupported compiler 'gcc' selected for architecture 'i386' new macports-tickets@… defect Normal
#42432 phantomjs-1.9.7 - two build breaks + two ugly fixes new stromnov@… defect Normal
#42447 Wireshark application request new opendarwin.org@… enhancement Normal
#42457 [update] volatility 2.3.1 new macports-tickets@… update Normal
#42459 zeroc-ice34-java, installation fails new blair@… defect Normal
#42463 gd2: destroot: file already exists new ryandesign@… defect Normal
#42475 sdf2-bundle compilation failure new macports-tickets@… defect Normal
#42480 strategoxt build failure - needs to link libErrorAPI? new macports-tickets@… defect Normal
#42482 argus: looking for plugins in '/usr/lib64/sasl2', failed to open directory, error: new macports-tickets@… defect Normal
#42484 Spam tickets new skarulkar@… defect Normal
#42489 mono-addins failed to compile new macports-tickets@… defect Normal
#42497 boost +universal fails with "bad register name" over a million times new macports-tickets@… defect Normal
#42506 sparsehash: configuration error new hum@… defect Normal
#42508 opencv @2.4.8 build fails new stromnov@… defect Normal
#42512 Tkinter not working with macports-installed pypy new jmr@… defect Normal
#42518 arm-rtems-gcc does not build new macports-tickets@… defect Normal
#42519 klayout submission new macports-tickets@… submission Normal
#42529 gst @3.1_4: build error (abort trap) new saispo@… defect Normal
#42530 atlas does not recognize gcc49 gfortran new vince@… defect Normal
#42533 [NEW] ossec new macports-tickets@… submission Normal
Note: See TracQuery for help on using queries.