New Ticket     Tickets     Wiki     Browse Source     Timeline     Roadmap     Ticket Reports     Search

Custom Query (3809 matches)

Filters
 
Or
 
  
 
Columns

Show under each result:


Results (2701 - 2800 of 3809)

Ticket Summary Status Owner Type Priority Milestone
#46880 Let different versions of lua coexist in an uniform way. new macports-tickets@… enhancement Normal
#46896 LaTeXML: update to 0.8.1 and fix Perl branches new macports-tickets@… update Normal
#46903 MoarVM 2015.02 new port new macports-tickets@… submission Low
#46911 wcslib install fails new macports-tickets@… defect Normal
#46913 port RefDB new macports-tickets@… request Normal
#46927 record successfully applied patches in the statefile new macports-tickets@… enhancement Normal
#46931 vcs_blackbox @1.20150222 Update to latest upstream new macports-tickets@… update Normal
#46932 py-stfio @0.14.1: update 0.14.2 new macports-tickets@… update Normal
#46933 stimfit @0.14.1: update 0.14.2 new macports-tickets@… update Normal
#46934 py-astropy: fitscheck script conflicts with py-pyfits new macports-tickets@… defect Normal
#46949 KDE ports fail due to iconutil to generating icons new macports-tickets@… defect Normal
#46952 akonadi update new macports-tickets@… update Normal
#46954 Add Portfile for European Southern Observatory (ESO) software repository new macports-tickets@… submission Normal
#46956 base should keep track of explicitly requested variants on install and only preserve those on upgrade new macports-tickets@… enhancement Normal
#46958 xmms2 @0.8DrO_o_8 build fails new macports-tickets@… defect Normal
#46959 sphinx 2.2.4_0 on Yosemite build failed on dependency mysql5 new macports-tickets@… defect Normal
#46961 Installation has frozen new macports-tickets@… defect Normal
#46975 kde4-runtime update to 14.12.2 new macports-tickets@… update Normal
#46977 git-extras update to 2.2.0 new macports-tickets@… update Normal
#46978 port submission: extra-cmake-modules new macports-tickets@… submission Normal
#46992 sudo port install source-highlight new macports-tickets@… defect Normal
#47001 gnutar doesn't work anymore. new macports-tickets@… defect Normal
#33788 exact-image looks for X11 in /usr/X11 new macports@… defect Normal
#37503 py-dulwich: universal variant is not universal new mail_ben_schmidt@… defect Normal
#35136 despotify: no sound new mail@… defect Normal
#27492 asterisk @1.6.2.10 run as non-root user new marc.blanchet@… enhancement Normal
#31485 asterisk @1.6.2.10 fails to build with clang new marc.blanchet@… defect Normal
#31497 asterisk: update to 1.8.7.0 new marc.blanchet@… update Normal
#31596 asterisk @1.6.2.20 (net) bus error new marc.blanchet@… defect Normal
#36963 asterisk: build fails new marc.blanchet@… defect Normal
#44025 asterisk @1.6.2.20: symbol dyld_stub_binding_helper not found new marc.blanchet@… defect Normal
#45977 asterisk @1.6.2.20_0: build fails with various linker errors new marc.blanchet@… defect Normal
#46360 [Port Abandoned] asterisk new marc.blanchet@… defect Normal
#34502 ogre@1.7.3 - pbxcp command execution failed, build failed. assigned marin@… defect Normal
#37734 Ogre out of date (1.7.3 -> 1.8.x) new marin.saric@… update Normal
#38624 Ogre build fails new marin.saric@… defect Normal
#43719 mp3blaster: error: use of undeclared identifier 'free' new marioscheel@… defect Normal
#39321 Remove old documentation new marius@… enhancement Low
#32581 reduce-algebra: don't break when runtime OS version != build-time OS version new mark.brethen@… defect Normal
#32582 reduce-algebra: put a redpsl wrapper in ${prefix}/bin new mark.brethen@… enhancement Normal
#32583 reduce-algebra: install docs in standard location new mark.brethen@… defect Normal
#32595 reduce-algebra @3.8.0-r1530 - build error new mark.brethen@… defect Normal
#34895 reduce-algebra installs but does not run new mark.brethen@… defect Normal
#39483 reduce-algebra: runtime errors new mark.brethen@… defect Normal
#45299 reduce-algebra does not find any packages new mark.brethen@… defect Normal
#45799 Can't build encfs-1.7.5-135_2 on OSX 10.6.8 new Markus.Ueberall@… defect Normal
#25415 dash universal variant fails new Mathias.Laurin+macports@… defect Normal
#45205 dash update new Mathias.Laurin+macports@… update Normal
#32318 pythia @8.135_0 conflicts with libevent on Event.h new mattiafrancescomoro@… defect Normal
#35698 pythia @8.135 does not install xmldoc directory new mattiafrancescomoro@… enhancement Normal
#31747 SQLite3 + libedit: ESC + Backspace behaves wrong new mcalhoun@… defect Normal
#34930 Precompiled binary packages incompatible with installed dependencies new mcalhoun@… defect Normal
#38740 sml-mode.el enhancement to support Emacs.app new mcalhoun@… enhancement Normal
#39017 db47 @4.7.25_2: should install "port select" files and depend on db_select new mcalhoun@… enhancement Normal
#44193 qt: allow side by side installation of qt4-mac and qt5-mac new mcalhoun@… enhancement Normal
#44204 qt5-mac: wrong pkg-config variables reopened mcalhoun@… defect Normal
#45915 qt5-creator-mac @3.2.2_0 fails to build new mcalhoun@… defect Normal
#46129 qt5-mac is missing QtUiTools framework/library new mcalhoun@… defect Normal
#46494 openjpeg +universal missing the nettle dependency new mcalhoun@… defect Normal
#46504 Update: dbus 1.8.14 new mcalhoun@… update Normal
#46589 gmp @6.0.0_1: ppc64 build fails with "Parameter syntax error" new mcalhoun@… defect Normal
#46740 gmp: configure fails new mcalhoun@… defect Normal
#38509 vtwm @5.4.6b puts its manpage in the wrong folder new mdales@… defect Normal
#43053 tgif @4.1.42_2: fatal error: ' X11 .rules' file not found new mdales@… defect Normal
#45928 cvc4 @1.4 Adding Java variant - updated Portfile new mdeters@… enhancement Normal
#46356 [Port Abandoned] cvc4 new mdeters@… defect Normal
#39427 dd_rescue @1.14: update to 1.33 new md@… update Normal
#41480 socat @1.7.2.1 builds without tun/tap support new md@… defect Normal
#45786 Update mhddfs to 0.1.39 new mellon85@… update Normal
#36554 zmq +pgm fails to build on 10.8.2 new merijn@… defect Normal
#32916 rabbitmq-server: launchctl script does not match created node new meyer@… defect Normal
#43473 rabbitmq-server: build fails when Python 2.7 is not the active version new meyer@… defect Normal
#46326 rabbitmq-server @3.1.5_1: upgrade to 3.4.2 new meyer@… update Normal
#29173 ld64 should symlink rather than copy ld and rebase on darwin > 10 assigned mfeiri@… defect Normal
#36560 Use hfsCompression new mfeiri@… enhancement Normal
#37601 libc-headers installs stdio.h masking OS libc header new mfeiri@… defect Normal
#39926 webkit-gtk 2.0.4 upgrade error: excess elements in struct initializer new mfeiri@… defect Normal
#46304 p5-pdl: missing HDF support new mgrimes@… defect Normal
#46305 p5-pdl: plplot fails to configure, disabled by default new mgrimes@… defect Normal
#46306 p5-pdl: enabling opengl support by default breaks build on the buildbots new mgrimes@… defect Normal
#28749 minc: update to 2.0.18 new mhough@… update Normal
#32066 gtksourceview2 @2.10.5 +quartz: Undefined symbols new micah.lerner@… defect Normal
#41984 gtksourceview2 fails to build new micah.lerner@… defect Normal
#32827 xsane not working with Canon Lide Scanner new michael.klein@… defect Normal
#38425 dvdisaster: build failure OS X 10.5.8 G4 PPC new michael.klein@… defect Normal
#13640 qt4-mac conflicts with qt3 on /opt/local/bin/lrelease new michaelld@… defect Normal
#20309 qt4-x11 doesn't support 10.6 or later new michaelld@… defect Normal
#20986 qt4-x11 update to 4.7.0 new michaelld@… update Normal
#21294 Enable cffi support in swig? new michaelld@… enhancement Normal
#27826 py26-pyqt4 switch from mac to x11 dist for dbus support new michaelld@… enhancement Normal
#32842 swig-python build fails for non-default build_arch new michaelld@… defect Normal
#34891 swig: subports do not respect build_arch new michaelld@… defect Normal
#35827 qt4-mac-mysql55-plugin only installs debug library if qt4-mac is installed with +debug variant new michaelld@… defect Normal
#36410 Qt applications are blurry on MBP Retina reopened michaelld@… enhancement Normal
#36431 qt4-mac: macdeployqt shows errors when trying to copy in frameworks new michaelld@… defect Normal
#36435 swig-octave: mkoctfile... configure: error: mkoctfile is not installed new michaelld@… defect Normal
#36497 qt4-mac @4.8.3_1 +quartz Unable to build on Tiger new michaelld@… defect Normal
#37368 qt4-mac: Undefined symbols _dbus_shutdown reopened michaelld@… defect Normal
#39221 Cannot deploy Qt applications with MacPorts port qt4-mac new michaelld@… defect Normal
#39495 qwt60+examples installed, but no examples found new michaelld@… enhancement Normal
Note: See TracQuery for help on using queries.