Custom Query (37 matches)

Filters
 
Or
 
  
 
Columns

Show under each result:


Ticket Summary Status Port Owner Type Priority
#32528 opencv @2.3.1a fixes and improvements: eigen, ffmpeg, docs, opengl, python, shared+static, tbb new opencv stromnov (Andrew Stromnov) enhancement Normal
#35088 OpenCV 2.4.1 has a bug on the pkg-config files new opencv stromnov (Andrew Stromnov) defect Normal
#35307 opencv @2.4.2 +universal configure failure: command execution failed new opencv stromnov (Andrew Stromnov) defect Normal
#35368 unable to build opencv with llvm-gcc-4.2 new opencv stromnov (Andrew Stromnov) defect Normal
#37314 opencv @2.3.1: error: ‘av_open_input_file’ was not declared in this scope new opencv stromnov (Andrew Stromnov) defect Normal
#38168 Conflicting declarations in tiff and opencv new tiff opencv stromnov (Andrew Stromnov) defect Normal
#38430 opencv: error: dispatch/dispatch.h: No such file or directory new opencv stromnov (Andrew Stromnov) defect Normal
#41333 Add CUDA as a variant to OpenCV new opencv stromnov (Andrew Stromnov) enhancement Normal
#41553 opencv @2.4.7_1 + enable cuda + configure error - build failure new opencv stromnov (Andrew Stromnov) defect Normal
#41794 Gcc48 incompatible with opencv new gcc48, opencv macports-tickets@… defect Normal
#42508 opencv @2.4.8 build fails new opencv stromnov (Andrew Stromnov) defect Normal
#42712 opencv 2.4.8_2 doesn't complete installation -DWITH_CUDA=ON on OS X 10.9.2 new opencv stromnov (Andrew Stromnov) defect Normal
#44355 opencv @2.4.9 - build failure: Undefined symbols for architecture x86_64: "_main", referenced from: start in crt1.10.6.o (And probable fix) new opencv stromnov (Andrew Stromnov) defect Normal
#47549 opencv @2.4.11_0 - fails to load tiff files new opencv stromnov (Andrew Stromnov) defect Normal
#48066 opencv @3.0.0 fails to build if opencv @2.4.11 is active new opencv stromnov (Andrew Stromnov) defect Normal
#48218 opencv @3.0.0_0: debug variant not producing debug symbols new opencv stromnov (Andrew Stromnov) defect Normal
#48288 CMake generating broken Xcode projects when using OpenCV new opencv cmake macports-tickets@… defect Normal
#48455 opencv @3.0.0: error: use of undeclared identifier 'PTHREAD_RECURSIVE_MUTEX_INITIALIZER' reopened opencv stromnov (Andrew Stromnov) defect Normal
#48506 opencv @2.3.3 add +contrb variant for opencv_contrib repository new opencv stromnov (Andrew Stromnov) enhancement Normal
#48728 opencv 3.0: java wrappers are not generated for extra modules new opencv stromnov (Andrew Stromnov) defect Normal
#49289 opencv @3.0.0 | ffmpeg-devel @20150916_x- error: use of undeclared identifier 'avcodec_free_frame'; did you mean 'avcodec_get_name'? new opencv stromnov (Andrew Stromnov) defect Normal
#49670 OpenCV 2.x (please re-instate or provide a new opencv2 port) new opencv stromnov (Andrew Stromnov) enhancement Normal
#51734 OpenCV needs patch to build with +vtk new opencv stromnov (Andrew Stromnov) defect Normal
#51829 opencv +vtk: Requested modules not available: vtkRenderingOpenGL new opencv stromnov (Andrew Stromnov) defect Normal
#53126 opencv @3.1.0_8 +avx2 +contrib +eigen +gdal +opencl +java +python27 +python35 +qt5 +tbb fails to build assigned opencv stromnov (Andrew Stromnov) defect Normal
#53427 opencv build error on 10.9.5 assigned opencv stromnov (Andrew Stromnov) defect Normal
#53603 opencv @3.2.0: error: property 'activeVideoMaxFrameDuration' not found on object of type 'AVCaptureDevice *'; did you mean 'activeVideoMinFrameDuration'? assigned opencv stromnov (Andrew Stromnov) defect Normal
#54484 opencv@2.4.10 +python27 build failure: 'QTKit/QTKit.h' file not found assigned opencv stromnov (Andrew Stromnov) defect Normal
#55523 opencv @3.2.0_1: Build failure with ffmpeg-devel @20171210 assigned opencv stromnov (Andrew Stromnov) defect Normal
#55737 Failed to configure opencv with +contrib variant assigned opencv stromnov (Andrew Stromnov) defect Normal
#56411 opencv @3.4.1_2+contrib fails to build with protobuf-cpp assigned opencv stromnov (Andrew Stromnov) defect Normal
#56574 opencv @3.4.1: error: conversion from '<anonymous>::ufixedpoint16' to 'uint8_t' (aka 'unsigned char') is ambiguous assigned opencv stromnov (Andrew Stromnov) defect Normal
#57346 opencv +python36: error: no type named 'SequenceNumber' in namespace 'google::protobuf::internal' assigned opencv stromnov (Andrew Stromnov) defect Normal
#57640 opencv @3.4.3: +contrib not configured correctly assigned opencv stromnov (Andrew Stromnov) defect Normal
#58811 opencv @3.4.7+universal: no matching function for call to 'max'; no viable conversion from 'NSRect' to 'CGRect' new opencv defect Normal
#58845 Python support for OpenCV4 assigned opencv4 stromnov (Andrew Stromnov) enhancement Normal
#60118 opencv and opencv4 conflict new opencv opencv4 defect Normal
Note: See TracQuery for help on using queries.