Custom Query (65 matches)

Filters
 
Or
 
  
 
Columns

Show under each result:


Ticket Summary Status Owner Type Priority Milestone
#18931 /opt/local/share/info/dir contains defective content new macports-tickets@… defect Normal
#33886 Startx script cannot handle fake domain names on PPC Tiger? assigned jeremyhu (Jeremy Huddleston Sequoia) defect Normal
#37103 ImageMagick 6.8.0 does not correctly display SVG files on PPC (here Leopard 10.5.8) new ryandesign (Ryan Schmidt) defect Normal
#37115 gcc43 produces on PPC Mac OS X 10.4.11, Tiger, an error with /opt/local/include/X11/Xlib.h new macports-tickets@… defect Normal
#37385 Qpdf @3.0.2 does not build on PPC Leopard Mac OS X 10.5.8 because of test failure for Pl_ASCII85Decoder reopened macports-tickets@… defect Normal
#38338 Pdftk @1.44 +gcc45 crashes by default new ryandesign (Ryan Schmidt) defect Normal
#39791 libstdcxx 4.8.1 fails to build on PPC Tiger because of undefined symbols assigned defect Normal
#41199 gconf @2.32.4_3 does not build because of missing symbol _PyUnicodeUCS2_AsUTF8String in/opt/local/lib/gobject-introspection/giscanner/_giscanner.so new macports-tickets@… defect Normal
#41355 Zenity @2.32.1_4 needs a fix after upgrade to libnotify @0.7.6_0 new dbevans (David B. Evans) defect Normal
#41752 binutils-2.24 fails to build on PPC Tiger because of "multiple definitions of symbol _filename_cmp" new macports-tickets@… defect Normal
#41894 Build of autotrace 0.31.1_9 does not detect installed pstoedit new macports-tickets@… defect Normal
#43998 icu: Build fails on PPC Tiger because of "ld: -rpath can only be used when targeting Mac OS X 10.5 or later" new macports-tickets@… defect Normal
#45831 defect: emacs 24.4_1 cannot be built on PPC Tiger and Leopard because it needs Clang 3.4 which cannot be built new drkp (Dan Ports) defect Normal
#46701 kerberos5 does not build on PPC Tiger, Mac OS X 10.4.11, because void value cannot be ignored as it ought to be assigned ryandesign (Ryan Schmidt) defect Normal
#47476 scons does not properly add header guards to generated config header new macports-tickets@… defect Normal
#47630 openldap @2.4.40_1 does not build on PPC Leopard, Mac OS X 10.5.8, presumingly when another Berkeley DB is present assigned defect Normal
#50567 findutils 4.6.0 cannot be installed on PPC Mac OS X 10.5.8, Leopard, because of strange directory name confdir-14B--- new macports-tickets@… defect Normal
#51815 librsvg @2.40.16 does not build on PPC Mac OS X 10.5.8, Leopard, because of "./libtool: eval: line 1085: syntax error near unexpected token `|' " reopened larryv (Lawrence Velázquez) defect Normal
#52116 Binutils @2.26 fail to build on PPC Leopard, Mac OS X 10.5.8, because ../include/libiberty.h contains unexpected material new macports-tickets@… defect Normal
#52117 Qpdf @6.0.0 does not build on PPC Leopard, Mac OS X 10.5.8 because of Undefined symbol "Pl_MD5::persistAcrossFinish(bool)" that ld could not find new macports-tickets@… defect Normal
#53404 `port upgrade outdated` changes colours in terminal emulation new defect Normal
#53905 gtk3 @3.22.11 does not build on PPC Mac OS X 10.4.11, Tiger, because "absolute addressing not allowed in slidable image" assigned dbevans (David B. Evans) defect Normal
#54068 mozjs17 @17.0.0_5 won't build (on PPC Tiger, Mac OS X 10.4.11) because sys/sysctl.h does not provide _SC_NPROCESSORS_ONLN but HW_NCPU assigned dbevans (David B. Evans) defect Normal
#54393 Port fails to execute an upgrade with the additional arguments given at invocation but uses it for upgrading the ports on which the given port depends new defect Normal
#54411 elftoolchain @0.7.1 won't build on Snow Leopard, Mac OS X 10.6.8, (cxx_stdlib = libc++) because of "Undefined symbols for architecture x86_64" assigned raimue (Rainer Müller) defect Normal
#54418 ftgl @2.1.3-rc5 fails to build on SnowLeopard, Mac OS X 10.6.8, because build dependency to GLUT is not recorded? new defect Normal
#54519 py27-cryptography @2.0: error: -Werror=sign-conversion: No option -Wsign-conversion assigned stromnov (Andrew Stromnov) defect Normal
#54640 py27-cryptography @2.0.3 does not build on PPC Leopard, Mac OS X 10.5.8, because "Symbol not found: _PyUnicodeUCS2_FromObject" assigned stromnov (Andrew Stromnov) defect Normal
#54799 gtk-doc @1.26 does not build on PPC Leopard, Mac OS X 10.5.8, because "Symbol not found: _PyUnicodeUCS2_AsUTF8String" assigned dbevans (David B. Evans) defect Normal
#55523 opencv @3.2.0_1: Build failure with ffmpeg-devel @20171210 assigned stromnov (Andrew Stromnov) defect Normal
#55525 py27-pynacl @1.2.1_1 does not build on PPC Leopard, Mac OS X 10.5.8, because Symbol not found: _PyUnicodeUCS2_FromObject assigned stromnov (Andrew Stromnov) defect Normal
#55528 py27-cython @0.27.3 built on Mac OS X 10.5.8, Leopard, stops py27-cryptography, py27-pynacl, nghttp2 from building assigned stromnov (Andrew Stromnov) defect Normal
#56196 fluxbox @1.3.7_1 does not compile on macOS High Sierra, Version 10.13.4, because it clock_gettime() and uses a pointer instead an int new defect Normal
#56423 emacs-devel @20170918 as X client cannot be used with recent fontconfig @2.13.0_0 and non-C locale accepted drkp (Dan Ports) defect Normal
#56513 gtk-doc @1.28_1 does not build on PPC Leopard, Mac OS X 10.5.8, because Python with UCS4 support is missing? new defect Normal
#56932 at-spi2-core @2.28.0 fails to build on Mac OS X 10.4.11 due to issues with -rpath in meson new defect Normal
#57032 mozjs52 @52.6.0, mozjs60 @60.1.0: Target C compiler target CPU (unknown) does not match --target CPU (powerpc) assigned defect Normal
#57333 xorg-server-devel @1.20.1 does not build on Mac OS X 10.5.8, Leopard, because of redefinition of typedef ‘CARD32’ assigned jeremyhu (Jeremy Huddleston Sequoia) defect Normal
#57506 libgcc6 @6.5.0 does not build on PPC Mac OS X 10.4.11, Tiger, with G4 (7447A) because of "Bootstrap comparison failure!" new defect Normal
#57547 gcc5 @5.5.0_4 does not build on PPC MacOS X 10.4.11, Tiger with HFSX because of "Bootstrap comparison failure!" new defect Normal
#57755 libmacho @921 does not build on PPC Mac OS X 10.4.11, Tiger, because execvp is missing assigned jeremyhu (Jeremy Huddleston Sequoia) defect Normal
#58540 xorg-libxcb @1.13.1 does not build on High Sierra (macOS 10.13.6) because building documentation never finds an end assigned jeremyhu (Jeremy Huddleston Sequoia) defect Normal
#58552 harfbuzz @2.5.1 does not build on PPC Leopard, Mac OS X 10.5.8, because some warnings being treated as errors assigned ryandesign (Ryan Schmidt) defect Normal
#58591 check @0.10.0 does not build on PPC Tiger, MacOSX 10.4.11, because of native void function unsetenv() new defect Normal
#58626 nss @3.44 does not build on Mac OS X 10.4.11, PPC Tiger, 'SHA_MASK8' and 'SHA_MASK16' are both undeclared new defect Normal
#58927 findutils @4.7.0_0 cannot be instaalled on PPC Mac OS X 10.5.8, Leopard, on HFSX because of some infinite loop? new defect Normal
#59021 kerberos5 @1.17_1 uses unused configure option --with-pkinit-crypto-impl and fails to find Python 3 on PPC Mac OS X 10.4.11, Tiger new defect Normal
#59115 libssh2 @1.9.0 fails to build on PPC Mac OS X 10.5.8 because '#pragma GCC diagnostic not allowed inside functions' assigned Gminfly defect Normal
#59122 py-numpy @1.17.2 does not build on PPC Tiger, Mac OS X 10.4.11, because of "'for' loop initial declaration used outside C99 mode" assigned michaelld (Michael Dickens) defect Normal
#59373 gtk3 @3.24.12 does not build on PPC Mac OS X 10.5.8, Leopard, because "too many nested evaluations (infinite loop?)" assigned dbevans (David B. Evans) defect Normal
#59571 py37-numpy @1.17.3 does not build on PPC Tiger, Mac OS X 10.4.11, because of many errors assigned michaelld (Michael Dickens) defect Normal
#59664 source-highlight @3.1.9 does not build on PPC Mac OS X 10.5.8, Leopard, because new source-highlight binary cannot produc HTML doc from Java source file reopened defect Normal
#59809 libtasn1 @4.15.0 does not build on PPC Tiger, Mac OS X 10.4.11, because: 'for' loop initial declaration used outside C99 mode assigned Schamschula (Marius Schamschula) defect Normal
#59876 ImageMagick @6.9.10-80 does not build on PPC Tiger, Mac OS X 10.4.11, because 'MagickAddressType' undeclared accepted ryandesign (Ryan Schmidt) defect Normal
#59939 pstoedit @3.75 does not build (documentation) on High Sierra because latex2man.sty is missing new defect Normal
#60093 gtkglext @1.2.0_11 +quartz does not configure on macOS Catalina, Version 10.15.3, because 'configure: error: X development libraries not found' new defect Normal
#60096 xorg-server-devel @1.20.4 does not build on macOS Catalina, version 10.15.3, because "../randr/randrstr.h:204:5: error: unknown type name 'RRLease'" assigned jeremyhu (Jeremy Huddleston Sequoia) defect Normal
#60120 gtk3 @3.24.14 does not build on PPC Tiger, Mac OS X 10.4.11, because "Something went wrong bootstrapping makefile fragments" new defect Normal
#60162 bash @5.0.16 builds on PPC Mac OS X 10.4.11, Tiger, with an error assigned raimue (Rainer Müller) defect Normal
#60165 meson @0.53.2 produces on PPC Mac OS X 10.4.11, Tiger, faulty files with illegal loader switch '-Wl,-rpath,@loader_path/' new defect Normal
#60181 atk @2.34.1_1 does not build on PPC Tiger, Mac OS X 10.4.11, because of -rpath new defect Normal
#60603 nss @3.53 does not build on PPC Tiger, Mac OS X 10.4.11, because *** missing `endif' new defect Normal
#60906 libraw @0.20.0 does not build on PPC Tiger, Mac OS X 10.4.11, because "integer constant is too large for 'long' type" new defect Normal
#60907 cmake @3.18.0_1 does not build on PPC Tiger, Mac OS X 10.4.11, because of 'Undefined symbols: "_lutimes"' new defect Normal
#60936 unbound @1.11.0 does not build on PPC Tiger, Mac OS X 10.4.11, because of error: 'IPV6_TCLASS' undeclared new defect Normal
Note: See TracQuery for help on using queries.