Custom Query (69 matches)

Filters
 
Or
 
  
 
Columns

Show under each result:


Ticket Summary Status Owner Type Priority Milestone
#39917 arm-elf-gdb conflicts with binutils new macports-tickets@… defect Normal
#39931 py-webkitgtk @1.1.8_7 build failure new elelay (Eric Le Lay) defect Normal
#39967 qt4-creator-mac 2.8.0_1 fails building on 10.5.8 PPC assigned michaelld (Michael Dickens) defect Normal
#39989 HPGS @1.1.8 new macports-tickets@… submission Normal
#40009 libproj4 @3_20081120_3+universal: arch mismatch with libgsl during build new tenomoto (Takeshi Enomoto) defect Normal
#40018 Error in mysqld_safe script prevents startup assigned defect Normal
#40022 mlton @20130715 new Portfile new macports-tickets@… submission Normal
#40023 boost-1.54.0 unit test framework crashing at runtime new macports-tickets@… defect Normal
#40042 base should ignore variant conflicts when cleaning new macports-tickets@… enhancement Normal
#40057 mysqlxx: update to 3.2.0 new macports-tickets@… update Normal
#40078 py27-sympy build fails: AttributeError: 'module' object has no attribute 'sqrtrem' new stromnov (Andrew Stromnov) defect Normal
#40094 pgAdmin3 uses --with-arch-x86_64 assigned defect Normal
#40105 alps @2.1.1 error: #error Compiling Filesystem version 3 file with BOOST_FILESYSTEM_VERSION defined != 3 assigned defect Normal
#40114 new submission - gpstk - science new macports-tickets@… submission Normal
#40125 grok: error: non-void function 'grok_predicate_regexp_init' should return a value [-Wreturn-type] assigned defect Normal
#40145 Some of gnome-chemistry-utils crash on startup new macports-tickets@… defect Normal
#40176 gfortran for ARM cross compiler assigned defect Normal
#40177 cross-compilers are missing the fortran compiler new macports-tickets@… defect Normal
#40180 gimp-app@2.8.2_1 fails to launch new dbevans (David B. Evans) defect Normal
#40194 muniversal: pre-merge hook for each destroot new macports-tickets@… defect Normal
#40214 cntlm is not UsingTheRightCompiler or -arch flags assigned defect Normal
#40224 Submission of a port for ocamlviz assigned pmetzger (Perry E. Metzger) submission Normal
#40246 jabber @1.4.2_5 (net) command execution failed assigned ryandesign (Ryan Schmidt) defect Normal
#40255 mapserver: configure fails when dependencies have not yet been installed new jea@… defect Normal
#40261 serf1: destroot fails assigned defect Normal
#40265 Gnumeric @1.12.x throws runtime warnings new macports-tickets@… defect Normal
#40278 Please add a port for telnet-tls new macports-tickets@… request Normal
#40305 New port: portitude new macports-tickets@… submission Normal
#40320 New port: p5-mime-base64-urlsafe new macports-tickets@… submission Normal
#40344 libdynd: universal variant fails: error unknown calling convention new stromnov (Andrew Stromnov) defect Normal
#40360 couchdb can't install into userdir new ci42 defect Normal
#40364 mongodb can't install into userdir new ryandesign (Ryan Schmidt) defect Normal
#40367 Avogadro2 @0.6.0 new macports-tickets@… submission Normal
#40369 MongoChem @0.5.0 new macports-tickets@… submission Normal
#40372 port GSI-Enabled OpenSSH new macports-tickets@… request Normal
#40393 hadoop install fails when setting up ssh assigned macports-tickets@… defect Normal
#40420 alienarena @7.53-20111227_1 received signal 11 assigned ryandesign (Ryan Schmidt) defect Normal
#40423 luarocks @2.0.13_2 is broken when Lua 5.1 is installed assigned anddam (Andrea D'Amore) defect Normal
#40436 py-ecell3 - new submission, cell simulation environment new macports-tickets@… submission Normal
#40449 Gnumeric @1.12.7 broken menu items... new macports-tickets@… defect Normal
#40455 Pallet doesn't upgrade new macports-tickets@… defect Normal
#40460 gtkglext-1.2.0 does compilation error on 10.8.4 assigned defect Normal
#40463 gettext hangs when cc points to a MacPorts gcc compiler new ryandesign (Ryan Schmidt) defect Normal
#40464 libquicktime @1.2.4: error: use of undeclared identifier 'AVCODEC_MAX_AUDIO_FRAME_SIZE' assigned macports-tickets@… defect Normal
#40478 gcc-4.8 (and likely earlier) build incorrectly +universal new larryv (Lawrence Velázquez) defect Normal
#40500 smokeqt configure fails new NicosPavlov defect Normal
#40519 Tiger, tor and openssl new macports-tickets@… request Normal
#40528 zeroc-ice35: ld: warning: ignoring file /opt/local/lib/libmcpp.dylib, file was built for unsupported file format which is not the architecture being linked assigned defect Normal
#40536 py27-webkitgtk 1.1.8_7 libraries not loading in python new elelay (Eric Le Lay) defect Normal
#40544 advi @1.10.2_2: +universal variant can't be used due to non-universal dependencies new macports-tickets@… defect Normal
#40547 gtk-osx-application @2.0.1 configure fails to find python... new macports-tickets@… defect Normal
#40548 libgcc: configure: error: GNU Fortran is not working; please report a bug assigned macports-tickets@… defect Normal
#40556 smokeping: Missing mod_fcgid dependency new macports-tickets@… defect Normal
#40656 Use -isystem instead of -I in default configure.cppflags reopened macports-tickets@… enhancement Normal MacPorts Future
#40674 phantomjs @1.9.2 build error - Undefined symbols in QTWebFrame new stromnov (Andrew Stromnov) defect Normal
#40706 port sync does not work with https source when behind authenticated proxy new macports-tickets@… defect Normal MacPorts Future
#40709 "-fgnu89-inline" should not be used when building with clang new macports-tickets@… defect Normal
#40729 kate @4.11.2_0 unexpected behavior with dynamic word wrap assigned NicosPavlov defect Normal
#40744 macports-built expect @5.45_4: crashes when used in a dejagnu testsuite new macports-tickets@… defect Normal
#40788 Avidemux: Macports application does not work new macports-tickets@… defect Normal
#40791 nant @0.91: pkgconfig file does not define prefix new macports-tickets@… defect Normal
#40807 graphviz @2.34.0: dot hangs when generating doxymentation on 10.6 new macports-tickets@… defect Normal
#40853 gcc43, gcc44: g++ is broken wrt exception handling assigned macports-tickets@… defect Normal
#40872 screen: attach in multiuser mode fails with "Attach attempt with bad pid" message assigned dgilman (David Gilman) defect Normal
#40912 DigiKam 3.5 corrupts JPG, TiFF, PNG images new jgosmann (Jan Gosmann) defect Normal
#40962 fox: universal build fails assigned defect Normal
#41103 libtool @2.4.2_4 put $prefix in dl search path new macports-tickets@… defect Normal
#40035 base aborts if current directory does not exist, even when given a port name new larryv (Lawrence Velázquez) defect Low
#40112 Julius 4.2.3 fails to upgrade non-universal to universal on 10.6 reopened hem@… defect Low
Note: See TracQuery for help on using queries.