Custom Query (52 matches)

Filters
 
Or
 
  
 
Columns

Show under each result:


Ticket Summary Status Owner Type Priority Milestone
#55089 Make "port requested" an alias for "port installed requested" new enhancement Normal
#55150 Pymol gives error on fetching from any https site assigned howarth.at.macports@… defect Normal
#55151 port install fails if $COLUMNS is unset new defect Normal
#55187 osxfuse permission issues assigned defect Normal
#55238 mysql57 @5.7.17: error: no member named 'ifr_ifrn' in 'ifreq' assigned defect Normal
#55243 Amavisd failed to start due to BerkeleyDB, libdb, and db.h incompatibility assigned defect Normal
#55254 gr-fcdproplus: distfile not found assigned michaelld (Michael Dickens) defect Normal
#55267 qucs @0.0.18 fails to configure and build assigned rowue@… defect Normal
#55288 QGIS Fails to Configure/Install - CMAKE cannot find FindQJSON assigned Veence (Vincent) defect Normal
#55301 openvrml @0.18.9_4: error: no member named 'check_is_close' in namespace 'boost::test_tools' accepted raphael-st (Raphael Straub) defect Normal
#55332 chown does not support changing group new defect Normal
#55445 install phase fails with "no destroot found" assigned defect Normal
#55468 macports destroot.umask not recursively applied new defect Normal
#55511 SourceKitten 0.17.6 "Error: Failed to destroot SourceKitten: command execution failed" assigned defect Normal
#55523 opencv @3.2.0_1: Build failure with ffmpeg-devel @20171210 assigned stromnov (Andrew Stromnov) defect Normal
#55525 py27-pynacl @1.2.1_1 does not build on PPC Leopard, Mac OS X 10.5.8, because Symbol not found: _PyUnicodeUCS2_FromObject assigned stromnov (Andrew Stromnov) defect Normal
#55528 py27-cython @0.27.3 built on Mac OS X 10.5.8, Leopard, stops py27-cryptography, py27-pynacl, nghttp2 from building assigned stromnov (Andrew Stromnov) defect Normal
#55546 Install dependencies without asking reopened enhancement Normal
#55556 python27, python36: IDLE does not start: no display name and no $DISPLAY environment variable assigned jmroot (Joshua Root) defect Normal
#55572 kmymoney4-devel build failure assigned NicosPavlov defect Normal
#55589 faac: Compiler blacklists only needed on x86 new defect Normal
#55627 cg-toolkit @3.1.2012.04_1 tries to install files into /usr, which SIP prevents assigned defect Normal
#55628 inkscape @0.92.2_1 +x11 builds but fails to launch assigned dbevans (David B. Evans) defect Normal
#55652 Cannot destroot libtool 2.4.6_4 assigned larryv (Lawrence Velázquez) defect Normal
#55657 redis @4.0.6_0 seems to work fine but errors every 10 seconds in syslog from launchd new defect Normal
#55673 destroot.keepdirs should behave better if specified path is not in destroot new defect Normal
#55719 codeblocks @16.01-11098: error: expected expression assigned defect Normal
#55721 netgen-lvs: New port accepted ryandesign (Ryan Schmidt) submission Normal
#55723 mplayer +nodvd fails assigned jeremyhu (Jeremy Huddleston Sequoia) defect Normal
#55733 lz4 @1.8.1.2: fails to build on systems following LibcxxOnOlderSystems accepted ryandesign (Ryan Schmidt) defect Normal
#55737 Failed to configure opencv with +contrib variant assigned stromnov (Andrew Stromnov) defect Normal
#55753 vtk needs tiff assigned stromnov (Andrew Stromnov) defect Normal
#55760 oracle-instantclient: Fetch failure assigned ryandesign (Ryan Schmidt) defect Normal
#55796 py27-goocanvas @0.14.1_6: Failed to destroot py27-goocanvas: command execution failed assigned alexander.afanasyev@… defect Normal
#55830 Activating Thunar Fails When Installing Xfce new defect Normal
#55831 postgis2 fails to compile on Snow Leopard assigned Veence (Vincent) defect Normal
#55883 bazel @0.9.0 failed: Worker process sent response with exit code: 1. assigned RootFunction defect Normal
#56008 port mirror does not indicate failure when checksum verification fails new defect Normal
#56029 ERR_EMPTY_RESPONSE on Userdirs assigned Schamschula (Marius Schamschula) defect Normal
#56031 gtimelog: Add GTK3 to dependencies assigned defect Normal
#56062 QGIS and QGIS3 built with the proj 5.0.0 fail to reproject many coordinates new defect Normal
#56080 android, android-ndk: out of date new update Normal
#56105 phantomjs fails to build assigned stromnov (Andrew Stromnov) defect Normal
#56120 pkg-config fails to find python3 new defect Normal
#56166 wine[-devel] freezes when WINEARCH=win64 is used assigned ryandesign (Ryan Schmidt) defect Normal
#56196 fluxbox @1.3.7_1 does not compile on macOS High Sierra, Version 10.13.4, because it clock_gettime() and uses a pointer instead an int new defect Normal
#56223 clang-6.0 unused regex? assigned jeremyhu (Jeremy Huddleston Sequoia) defect Normal
#56228 mysql57 @5.7.17: error: no type named 'self_ip_exception' in namespace 'boost::geometry::detail::self_get_turn_points' assigned defect Normal
#56248 burn-app 2.5.1: Build failure - QTKit.h file not found new defect Normal
#56261 erlang: file not found: /opt/local/lib/libcrypto.1.0.0.dylib assigned ci42 defect Normal
#56272 pangomm with +quartz variant does not compile as it requires pango with +x11 variant. assigned dbevans (David B. Evans) defect Normal
#56347 cfitsio @3.440_0: install_name not set correctly in configure patch, leading to incorrect rev-upgrade behaviour assigned defect Normal
Note: See TracQuery for help on using queries.