Custom Query (35 matches)

Filters
 
Or
 
  
 
Columns

Show under each result:


Ticket Summary Status Owner Type Priority Milestone
#56776 texworks @0.6.2 configure failure: Could not find Poppler assigned mojca (Mojca Miklavec) defect Normal
#56777 phantomjs fails to build assigned stromnov (Andrew Stromnov) defect Normal
#56793 Installing a port with many files appears appears hang new defect Normal
#56803 pdf2htmlex doesn't build assigned mojca (Mojca Miklavec) defect Normal
#56817 `port activate`: error selecting already active version/variant new defect Normal
#56828 inkscape @0.92.3_2+x11 Nothing to do! assigned dbevans (David B. Evans) defect Normal
#56835 weka @3.6.4: taskdef class net.sourceforge.jarbundler.JarBundler cannot be found new defect Normal
#56873 Inconsistent behavior between ncurses 6.1.20180127 and ncurses 5.7 reopened jmroot (Joshua Root) defect Normal
#56892 root6 @6.14.02 fails to build with +veccore variant assigned cjones051073 (Chris Jones) defect Normal
#56932 at-spi2-core @2.28.0 fails to build on Mac OS X 10.4.11 due to issues with -rpath in meson new defect Normal
#56971 kerberos5 @1.16.1: configure: error: cannot find output from flex; giving up assigned ryandesign (Ryan Schmidt) defect Normal
#56984 tkcvs 7.2.1 uses wish8.4, which doesn't exist on High Sierra assigned defect Normal
#56998 apache2: UserDir still not working assigned ryandesign (Ryan Schmidt) defect Normal
#57032 mozjs52 @52.6.0, mozjs60 @60.1.0: Target C compiler target CPU (unknown) does not match --target CPU (powerpc) assigned defect Normal
#57045 gdal-2.3.1_0+hdf5+netcdf+postgresql95 fails to build assigned Veence (Vincent) defect Normal
#57046 latex2man @1.23: installation failure due to unescaped left brace in regex accepted ryandesign (Ryan Schmidt) defect Normal
#57067 SIerra: issue with assembler "as" in conjunction with gfortran new defect Normal
#57086 pdb2pqr @2.1.1: pdb2pqr.py script fails to execute with 'bad interpreter' assigned jwhowarth defect Normal
#57093 caffe update fails after protobuf3 upgrade new defect Normal
#57096 root6 6.14.02 installed with python36 variant when python34 variant is specified assigned cjones051073 (Chris Jones) defect Normal
#57111 hdf5 @1.10.2: error: Fortran could not compile .f90 files assigned mamoll (Mark Moll) defect Normal
#57112 qgis does not built on mac os x 10.13 assigned Veence (Vincent) defect Normal
#57136 py-fabric: would it be possible to maintain a v1 and a v2 version of this port? assigned stromnov (Andrew Stromnov) request Normal
#57140 Installing Gimp via MacPorts on High Sierra (Gimp do not launch or disappear) assigned dbevans (David B. Evans) defect Normal
#57142 osxfuse @3.8.2 build failure: "No version of Xcode found" assigned drkp (Dan Ports) defect Normal
#57146 h5py Library not updated assigned eborisch (Eric A. Borisch) defect Normal
#57157 root6 with +veccore variant has include path problems assigned cjones051073 (Chris Jones) defect Normal
#57192 sane-frontends / sane-backends: git repository has changed to gitlab.com new defect Normal
#57198 libgcc8: build fails when libunwind-headers is installed new defect Normal
#57205 phantomjs @2.0.0_2: still broken port after rebuilding it more than 3 times assigned stromnov (Andrew Stromnov) defect Normal
#57209 macports-notifier failed with mojave new defect Normal
#57212 Freecell failed with Mojave new defect Normal
#57217 emacs-app does not render assigned drkp (Dan Ports) defect Normal
#57224 obc fails to compile/install on Mojave due to lack of 32 bit support new defect Normal
#56991 wine cannot be built against the 10.14 SDK assigned ryandesign (Ryan Schmidt) defect Low
Note: See TracQuery for help on using queries.