Custom Query (181 matches)

Filters
 
Or
 
  
 
Columns

Show under each result:


Results (1 - 100 of 181)

1 2
Ticket Summary Status Owner Type Priority Milestone
#54007 global @6.6.2: Provided /opt/local/share/gtags/script/pygments_parser.py has shebang that points to Apple's Python and this results in failure assigned defect Normal
#57238 msp430-binutils @2.21.1a-20120406_1: Fails to build on Mojave assigned g5pw (Aljaž Srebrnič) defect Normal
#57252 p5.26-net-ssleay @1.850.0 - Fails to build after Mojave/Command Line Tools/MacPorts upgrade, assumes sysroot is full XCode installation new defect Normal
#57283 problem with mpich-gcc7 on mojave assigned eborisch (Eric A. Borisch) defect Normal
#57310 tiemu3 @3.03 build fails on mojave new defect Normal
#57333 xorg-server-devel @1.20.1 does not build on Mac OS X 10.5.8, Leopard, because of redefinition of typedef ‘CARD32’ assigned jeremyhu (Jeremy Huddleston Sequoia) defect Normal
#57338 arpack configure failure assigned mamoll (Mark Moll) defect Normal
#57346 opencv +python36: error: no type named 'SequenceNumber' in namespace 'google::protobuf::internal' assigned stromnov (Andrew Stromnov) defect Normal
#57350 qt3 build fails new defect Normal
#57382 graphviz-gui package fails destroort assigned ryandesign (Ryan Schmidt) defect Normal
#57398 biblatex and biber versions incompatible with each other assigned drkp (Dan Ports) defect Normal
#57401 mupdf @1.14.0: mupdf-gl error: GLUT Warning: glutCurrentModifiers: do not call outside core input callback. assigned harciga defect Normal
#57405 atom @1.31.2 build failed on Mojave assigned kurthindenburg (Kurt Hindenburg) defect Normal
#57425 emacs-app or emacs-app-devel crashes on menu access with Tramp file open assigned drkp (Dan Ports) defect Normal
#57427 gnucash @3.3.0 upgrade fails due to unknown option "-Wno-register" assigned drkp (Dan Ports) defect Normal
#57429 AMC fails to start after MacPorts Install - cannot make GdkRectangle assigned nortcele defect Normal
#57466 upgrade outdated always rebuilds on hdfeos5 assigned tenomoto (Takeshi Enomoto) defect Normal
#57473 qt4-mac @4.8.7: configure not detecting arch properly assigned michaelld (Michael Dickens) defect Normal
#57474 bladeRF @20181024_1 fails to build on Mavericks assigned michaelld (Michael Dickens) defect Normal
#57475 ncarg @6.5.0_2: Install fails, wrong hdf5 variant assigned tenomoto (Takeshi Enomoto) defect Normal
#57482 Failed to build bzr: command execution failed assigned raimue (Rainer Müller) defect Normal
#57487 itext: error: package com.sun.image.codec.jpeg does not exist new defect Normal
#57505 sane-backends @1.0.27_2: Regression / libusb vs libusb-compat library linkage new defect Normal
#57506 libgcc6 @6.5.0 does not build on PPC Mac OS X 10.4.11, Tiger, with G4 (7447A) because of "Bootstrap comparison failure!" new defect Normal
#57524 krusader - screen glitches assigned kurthindenburg (Kurt Hindenburg) defect Normal
#57547 gcc5 @5.5.0_4 does not build on PPC MacOS X 10.4.11, Tiger with HFSX because of "Bootstrap comparison failure!" new defect Normal
#57595 tiff broken by zstd assigned ryandesign (Ryan Schmidt) defect Normal
#57601 ROOT6 headers broken assigned cjones051073 (Chris Jones) defect Normal
#57602 kdelibs4 @4.14.3_11 on mojave: kpty.cpp:215:9: error: no member named 'openpty' in the global namespace assigned NicosPavlov defect Normal
#57604 inkscape @0.92.3_5+quartz builds and installs but fails to run assigned dbevans (David B. Evans) defect Normal
#57610 unison @2.51.2_1 (net): build fails in macOS Mojave (v10.14.1) new defect Normal
#57640 opencv @3.4.3: +contrib not configured correctly assigned stromnov (Andrew Stromnov) defect Normal
#57648 perl5 builds incompletely with clang-3.4, resulting in dyld: lazy symbol binding failed: Symbol not found: _perl_tsa_mutex_lock new defect Normal
#57659 emacs-mac-app 7.4: error on clean installation new defect Normal
#57676 sshfs 2.x unable to create mount points (Sierra/High Sierra and later) assigned drkp (Dan Ports) update Normal
#57677 openjdk11 install finds broken files after multiple install attempts assigned breun (Nils Breunese) defect Normal
#57680 ccl fails to build on Mojave assigned easye defect Normal
#57691 Error: Failed to build zathura-plugin-pdf-mupdf: command execution failed assigned harciga defect Normal
#57710 XEmacs Autoload errors on brand new Mojave machine, everything from scratch assigned dstrubbe (David Strubbe) defect Normal
#57727 mpich-default @3.3_5+gcc8: fails upgrade assigned eborisch (Eric A. Borisch) defect Normal
#57736 Allow the location of archive_sites.conf and pubkeys.conf to be configured in macports.conf new enhancement Normal
#57742 cairo @1.16.0 +quartz+universal+x11: cannot upgrade from @1.14.12 to @1.16.0 assigned ryandesign (Ryan Schmidt) defect Normal
#57743 db48 +java build fails on MacOS 10.14.1 assigned jmroot (Joshua Root) defect Normal
#57746 coreutils date: localized output keeps C locale order new defect Normal
#57755 libmacho @921 does not build on PPC Mac OS X 10.4.11, Tiger, because execvp is missing assigned jeremyhu (Jeremy Huddleston Sequoia) defect Normal
#57760 darwinbuild @37 +universal Failed to build darwinbuild: command execution failed new defect Normal
#57767 py36-graph-tool uses incorrect python version 2.7 assigned count0 (Tiago de Paula Peixoto) defect Normal
#57786 py37-graph-tool graph_draw throws segmentation fault without XQuartz running assigned count0 (Tiago de Paula Peixoto) defect Normal
#57798 mariadb-10.1: Undeclared liblzo dependency assigned michaelld (Michael Dickens) defect Normal
#57912 OpenBLAS compilation fails on iMac Pro MacOS 10.13 assigned NicosPavlov defect Normal
#57922 lz4 @1.8.3 +universal: build fails on powerpc 10.5 assigned ryandesign (Ryan Schmidt) defect Normal
#57925 inkscape: Extension dialog boxes don't stay on top accepted dbevans (David B. Evans) defect Normal
#57931 emacs-app-devel @20190111_0: menu bar requires 2 clicks, is unresponsive, or has delays assigned drkp (Dan Ports) defect Normal
#57937 gcc9 @9-20181007_1: Compiler fails for trivial program indicating that _stdio.h is missing (also fails for gcc7 and gcc8). new defect Normal
#57964 port diagnose: could not execute xcode-select, no such file or directory new defect Normal
#57990 libxml2 @2.9.7_2: ICU include directory not in pkg-config output reopened ryandesign (Ryan Schmidt) defect Normal
#57994 OpenBLAS compilation fails on MacBook Pro MacOS 10.14 assigned defect Normal
#57996 ncmpc @0.33_0: error: default initialization of an object of const type 'const ScopeInitUTF8' without a user-provided default constructor assigned lbschenkel (Leonardo Brondani Schenkel) defect Normal
#58005 mythtv-core.28 @ 0.28.2-Fixes-20180201_5: Build failure on OSX 10.11 because of qt5 is replaced by qt511 assigned ctreleaven (Craig Treleaven) defect Normal
#58008 py36-h5py @2.9.0_0+mpich: h5py is running against HDF5 1.10.4 when it was built against 1.8.4 assigned eborisch (Eric A. Borisch) defect Normal
#58018 MacPorts fails to run after manual install via tarball new defect Normal
#58025 wine, wine-devel, wine-crossover: build ignores -universal assigned ryandesign (Ryan Schmidt) defect Normal
#58035 QLColorCode: 2.1.0 - thumbnail, but no preview assigned defect Normal
#58053 Could not install py36-tensorboard assigned emcrisostomo (Enrico Maria Crisostomo) defect Normal
#58074 request: flang Fortran compiler new request Normal
#58076 mongodb: portindex error assigned ryandesign (Ryan Schmidt) defect Normal
#58084 perl5.28: install_name_tool: malformed object (unknown load command 9) new defect Normal
#58085 gnome-online-accounts: configure: No package 'telepathy-account-widgets' found assigned dbevans (David B. Evans) defect Normal
#58090 New port request: libav new request Normal
#58094 objectmarker new defect Normal
#58098 Install openjdk8 as default JVM new enhancement Normal
#58100 ProjectLibre Portfile crash when destroot with "xinstall: Inappropriate file type" new submission Normal
#58106 rb-eventmachine using incorrect cxx_stdlib assigned kimuraw (kimura wataru) defect Normal
#58109 MPlayer: error: invalid output constraint '=o' in asm new defect Normal
#58117 Arduino: should fetch files in fetch phase and not in build phase new enhancement Normal
#58133 texlive-pstricks may need an update assigned drkp (Dan Ports) defect Normal
#58160 macOS 10.4.11: failed to build py27-psutil due to lack of libproc support assigned stromnov (Andrew Stromnov) defect Normal
#58161 Guide does not explain that selectors use regular expressions new defect Normal
#58197 mysql57 @5.7.25: port select fails: target "/opt/local/share/man/mysql57/man1/mysql-stress-test.pl.1.gz" doesn't exist new defect Normal
#58208 gcc8 @8.3.0: binary, does not pull in correct version of isl new defect Normal
#58216 openconnect @8.02 doesn't work on 10.11 El Capitan new defect Normal
#58220 Qgis on Snow Leopard assigned Veence (Vincent) defect Normal
#58223 Add Sass-dart to macport new request Normal
#58236 mosesdecoder @20121007_2: error: invalid operands to binary expression new defect Normal
#58244 soprano 2.9.4_3: build fails to detect Oracle JDK v12 new defect Normal
#58275 octave does not build graphics toolkit qt with qt4 assigned MarcusCalhoun-Lopez (Marcus Calhoun-Lopez) defect Normal
#58281 twain-sane does not support x86-64 new defect Normal
#58286 install of graphviz attempts to create directory /usr/lib/lua and fails assigned ryandesign (Ryan Schmidt) defect Normal
#58325 X11 is misbehaving: time lag in "command display" assigned jeremyhu (Jeremy Huddleston Sequoia) defect Normal
#58327 qcachegrind @0.7.4: error: ordered comparison between pointer and zero assigned devernay (Frédéric Devernay) defect Normal
#58331 Tensorflow freezes assigned emcrisostomo (Enrico Maria Crisostomo) defect Normal
#58332 py27-astropy segfaults at 14% in tests assigned duncanmmacleod (Duncan Macleod) defect Normal
#58345 at-spi2-core does not build with meson @0.50.0_0: ERROR: Subdir keyword must not be an absolute path assigned dbevans (David B. Evans) defect Normal
#58355 git-cola 3.1: Several sphinx modeule dependencies are missing. assigned raimue (Rainer Müller) defect Normal
#58392 Wireshark3: Missing Tool SSHDump accepted ghosthound defect Normal
#58407 error in building gexiv2 0.10.9 on 10.6.8 assigned dbevans (David B. Evans) defect Normal
#58421 unable to install poppler-qt5 (as dependency to texstudio) assigned dbevans (David B. Evans) defect Normal
#58422 pdfcrop link in texlive-bin-extra points to nowhere assigned drkp (Dan Ports) defect Normal
#58425 QGLE @4.2.5_12: fatal error: 'glu.h' file not found new defect Normal
#58433 PHP curl outputs "* Closing connection 0" assigned ryandesign (Ryan Schmidt) defect Normal
1 2
Note: See TracQuery for help on using queries.