Custom Query (324 matches)

Filters
 
Or
 
  
 
Columns

Show under each result:


Results (1 - 100 of 324)

1 2 3 4
Ticket Summary Status Owner Type Priority Milestone
#57391 port log and port logfile don't accept subport new defect Normal
#57905 gnome-internet-radio-locator 1.6.0 hangs on Mac OS X 10.14.2 with MacPorts 2.5.4 assigned oleaamot (Ole Aamot) update Normal
#58635 scalapack @2.02+gcc9+openmpi+openblas: error: expected expression before '_Static_assert' new defect Normal
#59100 ffmpeg @4.2.1+gpl2: error: unknown type name 'OPJ_SIZE_T' assigned dbevans (David B. Evans) defect Normal
#59419 nodejs12 @ 12.12.0_1: gyp: No Xcode or CLT version detected! assigned ci42 defect Normal
#59435 gobject-introspection @1.58.3_2+universal: Failed to build gobject-introspection: command execution failed assigned dbevans (David B. Evans) defect Normal
#59436 libxml2 @2.9.9: libxml2-config.cmake LIBXML2_LIBRARIES includes libxml2's dependencies, which results in overlinking new defect Normal
#59439 php is overlinked to icu and libxml2's other dependencies assigned ryandesign (Ryan Schmidt) defect Normal
#59443 cargo-stage1 checksum failed new defect Normal
#59445 restore_ports.tcl: fail with a better message in case of dependency cycle new enhancement Normal
#59453 R @3.5.1: Fails to compile on Mojave (10.14.6) with XCode 11 (11.1 11A1027) assigned kjellpk (Kjell Konis) defect Normal
#59454 librsvg @2.44.14_0+viewer, adwaita-icon-theme @3.34.0_0: dependency cycle assigned dbevans (David B. Evans) defect Normal
#59457 Kerberos5 checksum failing assigned ryandesign (Ryan Schmidt) defect Normal
#59460 catalina $PATH not set when installer run from standard account new defect Normal
#59461 mongodb @4.0.13: duplicate symbols reopened ryandesign (Ryan Schmidt) defect Normal
#59463 Binary-only mode requested with no usable archive sites configured new defect Normal
#59469 mosh @1.3.2: mosh-server crashing assigned quentinmit (Quentin Smith) defect Normal
#59473 py38-shiboken: fatal error: 'Python.h' file not found assigned mamoll (Mark Moll) defect Normal
#59476 tesseract @4.0.0: the man page cannot be built correctly assigned markemer (Mark Anderson) defect Normal
#59480 R @3.5.1_3 +builtin_lapack+cairo+gcc8+recommended+x11: Building issue: Symbol not found: _timespec_get expected in: /usr/lib/libSystem.B.dylib assigned kjellpk (Kjell Konis) defect Normal
#59489 ALPSMaxent: The C++ compiler used to build your project should exactly match the C++ compiler that was used to build ALPSCore assigned egull defect Normal
#59491 emergent @5.3.7: Found unsuitable Qt version "" from NOTFOUND, this code requires Qt 4.x new defect Normal
#59495 ansible-lint @3.4.19 fails to build assigned zdw@… defect Normal
#59502 xemacs @21.4.22_15+sumo: Malformed UTF-8 character: \xe4\x2c\x20 assigned dstrubbe (David Strubbe) defect Normal
#59511 bootstrap ports fail to build on Mojave and later new defect Normal
#59529 p5.28-xml-parser fails to build new defect Normal
#59530 nostromo: strlcat.c:34:1: error: expected parameter declarator new defect Normal
#59531 nodejuice, npm3, npm4: depend on nodejs6 which is replaced by another port assigned ci42 defect Normal
#59534 msbuild: error MSB4019: The imported project ... was not found reopened MarcusCalhoun-Lopez (Marcus Calhoun-Lopez) defect Normal
#59535 swish-e @2.4.7: error: conflicting types for 'uncompress2' new defect Normal
#59540 pound: unexpected type name 'TABNODE': expected expression; use of undeclared identifier 't' new defect Normal
#59541 lws @0.6.1: Undefined symbols: "_CRYPTO_set_locked_mem_functions" new defect Normal
#59542 cadaver: error: could not find library containing SSL_library_init assigned mklein-de (Michael Klein) defect Normal
#59546 edbrowse: error: duplicate case value '4294967295' assigned obrienj@… defect Normal
#59549 amber: Error: unexpected token: = assigned conradwt (Conrad Taylor) defect Normal
#59554 rbmake: error: incomplete definition of type 'struct png_struct_def' new defect Normal
#59559 dsniff @2.4b1_2: error: use of undeclared identifier 'R_NOOVERWRITE' new defect Normal
#59566 caf @0.17.2: error: constexpr constructor never produces a constant expression assigned Schamschula (Marius Schamschula) defect Normal
#59574 zeroc-ice35: error: member access into incomplete type 'SSL' (aka 'ssl_st') new defect Normal
#59589 istioctl: relocation target runtime.typedmemmove not defined for ABI0 (but is defined for ABIInternal) assigned nickolaev defect Normal
#59593 ndcctools @6.0.16: Sorry, I can't proceed without Mac OS X Command Line Tools. assigned pivie@… defect Normal
#59598 krbafs @1.2: error: unknown type name 'des_cblock' new defect Normal
#59600 libpreludedb @0.9.15.1+perl5 references perl5.8 new defect Normal
#59601 qt5-qt3d @ 5.12.5 configure fails ERROR: Feature 'system-assimp' was enabled, but the pre-condition 'features.assimp && libs.assimp' failed assigned MarcusCalhoun-Lopez (Marcus Calhoun-Lopez) defect Normal
#59614 osxfuse @3.8.3_0 : Build fails without Xcode installed assigned drkp (Dan Ports) defect Normal
#59616 py37-numpy: Symbol not found: _environ, Referenced from: libgfortran.5.dylib, Expected in: flat namespace assigned michaelld (Michael Dickens) defect Normal
#59617 py27-gsl @2.3.0: ImportError: No module named errno new defect Normal
#59627 yara @3.11.0: error: too many arguments to function call, expected 2, have 3 new defect Normal
#59630 demeter-devel: ld: library not found for -lgfortran assigned joefowler (Joe Fowler) defect Normal
#59633 Poppler needs libcryptopp assigned dbevans (David B. Evans) defect Normal
#59634 bacula @9.4.4: clang++-mp-5.0: No such file or directory new defect Normal
#59637 babl @0.1.72+universal: error: initializing '__m128i' (vector of 2 'long long' values) with an expression of incompatible type 'int' assigned dbevans (David B. Evans) defect Normal
#59638 emacs: error: use of undeclared identifier 'MD5_DIGEST_SIZE' assigned drkp (Dan Ports) defect Normal
#59641 mariadb @5.5.66: error: unknown type name 'SHA1_CONTEXT' assigned michaelld (Michael Dickens) defect Normal
#59646 htcondor @8.8.1_1 Failed to build htcondor assigned lpsinger (Leo Singer) defect Normal
#59647 Catalina: neomutt cannot access $HOME/Maildir for directory browsing assigned lbschenkel (Leonardo Brondani Schenkel) defect Normal
#59660 py36-isce2 fails to rebuild with Xcode 11.2 assigned piyushrpt defect Normal
#59664 source-highlight @3.1.9 does not build on PPC Mac OS X 10.5.8, Leopard, because new source-highlight binary cannot produc HTML doc from Java source file reopened defect Normal
#59665 gcc9 pre-built binary can't access system SDK with Xcode 11.2 under Mojave new defect Normal
#59680 hyperref links are coming out as solid blocks of color assigned drkp (Dan Ports) defect Normal
#59685 gtk-doc: gtkdoc-rebase: /opt/local/bin/python3.6: bad interpreter: No such file or directory assigned dbevans (David B. Evans) defect Normal
#59687 build of kmymoney4 failed at libiodbc assigned nerdling (Jeremy Lavergne) defect Normal
#59691 After a time, MacPorts cannot determine the Xcode version, on Snow Leopard new defect Normal
#59701 feh @3.2.1+universal: clang: error: cannot use 'dependencies' output with multiple -arch options new defect Normal
#59703 ndcctools @6.2.10: universal variant fails assigned pivie@… defect Normal
#59708 Kate @4.14.3_5 build failure: Failed to generate ICNS assigned NicosPavlov defect Normal
#59711 gpscorrelate @2.0: needs to use the right compiler, cflags, cxxflags, ldflags assigned sikmir (Nikolay Korotkiy) defect Normal
#59716 geos: error: cannot omit braces around initialization of subobject when using direct list-initialization assigned stromnov (Andrew Stromnov) defect Normal
#59727 gcc9: fails to link properly (-lSystem no found) new defect Normal
#59741 telepathy-qt @0.9.8: Could not find a package configuration file provided by "Qt5" assigned NicosPavlov defect Normal
#59745 libdynd @0.7.2: error: 'bind1st<std::__1::equal_to<char>, char>' is deprecated assigned stromnov (Andrew Stromnov) defect Normal
#59750 ffmpeg and ffmpeg-devel immediately crash with segfault 11 when input is mp4 assigned dbevans (David B. Evans) defect Normal
#59753 gildas @201911b: does not build for the right C++ stdlib (undefined symbols) assigned bardeau defect Normal
#59754 Failed to configure mpich-default: configure failure: command execution failed assigned eborisch (Eric A. Borisch) defect Normal
#59756 emacs-app-devel @20191120: Failed to connect to git.savannah.gnu.org port 80: Network is unreachable assigned drkp (Dan Ports) defect Normal
#59757 libpurple: configuration error reopened dbevans (David B. Evans) defect Normal
#59773 xorg-server @1.20.5: x11perf fails with BadMatch / X_GetImage assigned jeremyhu (Jeremy Huddleston Sequoia) defect Normal
#59774 zig @0.5.0: Undefined symbol: _futimens assigned felix@… defect Normal
#59785 llvm ports opportunistically build ocaml binding even when +ocaml variant is not selected; leads to conflicts between them assigned jeremyhu (Jeremy Huddleston Sequoia) defect Normal
#59786 perl5.30 forces modules to build with clang-3.4, though they don't declare a dependency on it assigned mojca (Mojca Miklavec) defect Normal
#59788 lnav @0.8.5 fails to configure on mavericks assigned g5pw (Aljaž Srebrnič) defect Normal
#59800 wxWidgets-3.0: error: unknown type name 'nullptr_t'; did you mean 'std::nullptr_t'? assigned mojca (Mojca Miklavec) defect Normal
#59803 libnet @1.0.2a only installs static libraries assigned jim@… defect Normal
#59805 FileZilla @3.46.0: fatal error: 'optional' file not found assigned lhaeger (Lothar Haeger) defect Normal
#59809 libtasn1 @4.15.0 does not build on PPC Tiger, Mac OS X 10.4.11, because: 'for' loop initial declaration used outside C99 mode assigned Schamschula (Marius Schamschula) defect Normal
#59818 openmpi-devel-gcc9 @4.0.1: error: ptrdiff_t type is not available new defect Normal
#59825 Hexchat build failure assigned raimue (Rainer Müller) defect Normal
#59826 py37-tensorflow 2.0.0 crashes with protobuf3 assigned emcrisostomo (Enrico Maria Crisostomo) defect Normal
#59836 port should explicitly say to use sudo when upgrading new enhancement Normal
#59840 valgrind needs update assigned raimue (Rainer Müller) update Normal
#59843 ds9 @8.1_1 build failure assigned lpsinger (Leo Singer) defect Normal
#59845 qgis @2.18.17 build failure assigned Veence (Vincent) defect Normal
#59858 vde2 @2.3.1_3 build failure new defect Normal
#59874 rocksdb @5.14.3: error: declaration shadows a variable in namespace 'rocksdb' assigned stromnov (Andrew Stromnov) defect Normal
#59876 ImageMagick @6.9.10-80 does not build on PPC Tiger, Mac OS X 10.4.11, because 'MagickAddressType' undeclared accepted ryandesign (Ryan Schmidt) defect Normal
#59881 uftp3 @3.7.2: does not build with openssl 1.1 new defect Normal
#59883 ustl @1.5: clang: error: unknown argument: '-fno-enforce-eh-specs' new defect Normal
#59887 tuxtype: chown: games: illegal group name new defect Normal
#59890 py-graph-tool has wrong condition for deciding when to use sparsehash assigned count0 (Tiago de Paula Peixoto) defect Normal
#59893 p5-wx: Compilation failed in require at Makefile.PL line 21. assigned mojca (Mojca Miklavec) defect Normal
1 2 3 4
Note: See TracQuery for help on using queries.