New Ticket     Tickets     Wiki     Browse Source     Timeline     Roadmap     Ticket Reports     Search

Most Recent Active Tickets (3734 matches)

Filters
 
Or
 
  
 
Columns

Show under each result:


Results (1 - 100 of 3734)

1 2 3 4 5 6 7 8 9 10 11
Ticket Summary Component Port Created Modified
#43381 openmpi-default @1.7.5_1+gcc48 does not work with hwloc @1.9_0 ports openmpi-default, hwloc 72 minutes 72 minutes
#43380 Error: Processing of port lmms failed ports lmms 96 minutes 96 minutes
#43379 Xastir: OSM maps not showed ports xastir 4 hours 4 hours
#43378 trunk/doc-new/guide/xml/portfile-phase.xml typo line 911 guide 6 hours 6 hours
#43376 Create new php-apcu port ports 8 hours 8 hours
#43375 wview version number needs to be updated ports 8 hours 8 hours
#43373 [update] zabbix 2.2.1 -> 2.2.3 ports zabbix2 18 hours 18 hours
#43372 [NEW] nagios-plugins-jedda ports nagios-plugins-jedda 19 hours 70 minutes
#43371 [update] nagios-plugins 1.4.15 -> 2.0 ports nagios-plugins 19 hours 18 hours
#43369 textmate2 @2.0-alpha.9529 build error - git, reference is not a tree ports textmate2 34 hours 23 hours
#43366 [kde4-runtime] [version 1] [configure failure... failed to install] ports kde4-runtime 43 hours 18 hours
#43364 larn will not compile ports larn 45 hours 36 hours
#43362 bitcoind 0.8.6.08b93f9a65ce70e650244f94725fcd042d97f0ee fails config (libdb_cxx missing) ports bitcoind 2 days 18 hours
#43353 clang-3.4: error: 'assertion_failed__839' declared as an array with a negative size ports clang-3.4 2 days 23 hours
#43351 tmux @1.9a; wrong file is copied to vim's ftdetect, breaking vim syntax ports tmux 3 days 42 hours
#43349 Wireshark fails to build on OS X 10.9.2, MacPorts base version 2.2.1 ports wireshark 3 days 3 days
#43347 py-jedi: Update to 0.7.0 ports py-jedi 3 days 3 days
#43346 glib2 @2.40.0 issues a "Got weird mach timebase info" error when running Inkscape 0.48.4 r9939 ports glib2 3 days 3 days
#43345 distfiles.macports.org does not respond to pings server/hosting 3 days 3 days
#43344 Server certificate not trusted on buildslaves server/hosting 3 days 3 days
#43343 php52 mirror link changed ports php52 4 days 3 days
#43342 php4 freetype2 not found during install ports php4 4 days 3 days
#43339 Update arb to 6.0 ports arb 4 days 3 days
#43338 Update mongodb to 2.6.0 ports mongodb 4 days 2 days
#43337 Building gsl+doc fails ports gsl 4 days 2 days
#43336 Roccat Mouse Driver Port ports 4 days 4 days
#43333 Ports using platform or os for version based changes will probably fail if macosx_deployment_target is different than the current platform ports 5 days 4 days
#43330 bahamut 2.0.7: build fails ports bahamut 5 days 3 days
#43326 osh @20131109: update to 20140410 ports osh 5 days 3 days
#43325 CyaSSL 2.9.4 Version Bump ports cyassl 5 days 5 days
#43321 py-scipy @0.13.3_1: builds agains ATLAS (variant +atlas) Seg. fault during testing. ports py-scipy atlas 5 days 3 days
#43319 p5.12-parse-recdescent needs dependency on p5.12-extutils-makemaker ports p5.12-parse-recdescent 6 days 5 days
#43318 py-llvmpy should depend on llvm-3.3 not 3.2 ports py-llvmpy 6 days 5 days
#43316 git-core @1.9.1 cannot be built because tarball is nowhere. ports git-core 6 days 6 days
#43315 glib2 @2.40.0 big_chunk_size.png reported as PNG:CVE-2013-1331 [Expl] by Avast. ports glib2 6 days 6 days
#43314 scheme48-1.9.1 Build Errors ports scheme48 6 days 6 days
#43312 gdb @7.6: update to 7.7. ports gdb 6 days 6 days
#43311 iTerm2: update to 1.0.0.20140403 ports iTerm2 7 days 5 days
#43310 py-twisted: Update to 13.2.0 ports py-twisted 7 days 6 days
#43306 clustalx @2.1: error: implicit instantiation of undefined template 'std::__1::basic_string<char, std::__1::char_traits<char>, std::__1::allocator<char> >' ports clustalx 7 days 7 days
#43304 mapm3 @3.0_4+large_datasets, runtime error, Abort trap: 6 ports mapm3 7 days 7 days
#43303 openssl needs no-asm flag when building on PPC ports openssl 7 days 7 days
#43301 squid3 - adding squid_ldap_group ports squid3 7 days 7 days
#43300 New port request, Stacks, for Next-Gen DNA short-read sequences ports stacks 7 days 7 days
#43298 Please add spectrwm ports spectrwm 7 days 7 days
#43292 py27-scrapy: missing dependency: w3lib ports py27-scrapy 8 days 7 days
#43291 more integrated security notification: security page, port selfupdate notice, ... base 8 days 6 days
#43286 darktable @1.1.2: update to latest version 1.4.1 ports darktable 8 days 8 days
#43285 mod_gnutls @0.5.10_1: error: gnutls/extra.h: No such file or directory ports mod_gnutls 8 days 7 days
#43283 gtk3 @3.12.0 +quartz build fails on OS X 10.6.8 ports gtk3 8 days 8 days
#43281 jpilot @1.8.1: extract fails ports jpilot 8 days 7 days
#43278 rtorrent segfault on restart ports rtorrent 9 days 8 days
#43276 LibreCAD: Build failure due to muparser ports LibreCAD 9 days 7 days
#43272 py33-zmq @14.1.1 +universal and arch -i386 ipython notebook error ports py-zmq 9 days 9 days
#43269 gcc47 @4.7.3_3: internal compiler error: in bitmap_set_replace_value, at tree-ssa-pre.c:862 ports gcc47 9 days 9 days
#43267 glade @3.16.1: crashes on Snow Leopard ports glade 9 days 26 hours
#43264 grace@5.1.23: crashes with SIGSYS on mavericks ports grace 9 days 7 days
#43261 py27-gobject3: No package 'pycairo' found ports py-gobject3 10 days 10 days
#43260 [NEW] docker ports docker 10 days 9 days
#43259 isl @0.12_0: checksum mismatch ports isl 10 days 45 hours
#43257 [NEW] workrave ports workrave 10 days 20 hours
#43256 tftp-hpa 0.48: update to 5.2 ports tftp-hpa 10 days 10 days
#43254 gnucash: +python27 variant broken ports gnucash 10 days 5 days
#43253 nettle: universal build assumes Intel build platform ports nettle 10 days 10 days
#43252 yafc @1.1.1: destroot failure with texinfo 5 ports yafc 10 days 10 days
#43251 scapy Portfile improvements ports scapy 11 days 10 days
#43249 wireshark @1.10.5: build fails: _g_memmove undefined ports wireshark 11 days 6 days
#43248 [update] wireshark 1.10.6 ports wireshark 11 days 9 days
#43245 Port 2.2.99 cannot be configured on PPC Mac OS X 10.4.11 because "/usr/bin/gzip has 3 other links" ports MacPorts 11 days 10 days
#43244 vowpal_wabbit build fails ports vowpal_wabbit 11 days 6 days
#43240 [update] m2crypto patch ports py-m2crypto 11 days 8 days
#43239 [update] openvpn2 2.3.2 ports openvpn2 11 days 27 hours
#43238 when updating hash, port should offer recent hash set base 11 days 9 days
#43237 destroot.config setting to manage configuration files base 11 days 9 days
#43233 [update] asterisk 12.1.1 ports asterisk 12 days 12 days
#43232 cacti port improvements ports cacti 12 days 11 days
#43231 [update] syslog-ng 3.0.8 to 3.5.4.1 ports syslog-ng 12 days 12 days
#43230 textmate2 @2.0-alpha.9529: error: use of undeclared identifier 'plist'; did you mean 'klist'? ports textmate2 12 days 11 days
#43229 [update] p5-net-rawip 0.25 ports p5-net-rawip 12 days 9 days
#43228 MacPorts for Lion hangs : Running package scripts base 12 days 11 days
#43227 [NEW] fcgiwrap 1.1.0 ports fcgiwrap 12 days 12 days
#43226 [NEW] r-curl ports r-curl 12 days 12 days
#43225 [new] rb-vagrant ports rb-vagrant 12 days 12 days
#43224 [update] rb19-bundler ports rb19-bundler 12 days 11 days
#43222 mkvtoolnix: upgrade to version 6.8.0 ports mkvtoolnix 12 days 8 days
#43220 Update rxvt-unicode to 9.19 ports rxvt-unicode 12 days 12 days
#43215 Compilation error: volta-0.2.0 ports volta 12 days 12 days
#43214 codeblocks/wxWidgets-3.0: wxcrt.h: error: call to 'wcsstr' is ambiguous ports wxWidgets-3.0, codeblocks 12 days 12 days
#43210 Missing error messages base 12 days 8 days
#43209 nettle: port abandoned ports nettle 12 days 10 days
#43208 PortIndex2MySQL.tcl: can't find package Tclx base 13 days 9 days
#43207 squid (ftp proxy) moving server/hosting 13 days 12 days
#43206 capnproto @0.4.1: Version mismatch between generated code and library headers. You must use the same version of the Cap'n Proto compiler and library. ports capnproto 13 days 13 days
#43205 curl-ca-bundle: fails to verify macports.org certificate ports curl-ca-bundle 13 days 12 days
#43204 Change BZIP2 variable name for configure script base 13 days 9 days
#43201 nginx @1.4.7 add dav-ext module option ports nginx 13 days 12 days
#43199 darktable: Freetype_INCLUDE_DIR NOTFOUND ports darktable 13 days 13 days
#43198 libquicktime-devel: buildbot refuses to fetch sources from CVS server/hosting libquicktime-devel 13 days 13 days
#43195 cmake guru required so I can finish x265 Portfile ports x265 13 days 12 days
#43193 perl PortGroup: add support for multiple Perl versions ports perl5 13 days 12 days
1 2 3 4 5 6 7 8 9 10 11
Note: See TracQuery for help on using queries.