New Ticket     Tickets     Wiki     Browse Source     Timeline     Roadmap     Ticket Reports     Search

Most Recent Active Tickets (4059 matches)

Filters
 
Or
 
  
 
Columns

Show under each result:


Results (101 - 200 of 4059)

1 2 3 4 5 6 7 8 9 10 11 12
Ticket Summary Component Port Created Modified
#50347 qt4-mac lacks global pkgconfig data ports qt4-mac 3 weeks 3 weeks
#50345 port request: Trinity Desktop Environment (TDE) ports 3 weeks 3 weeks
#50343 wireshark build fails: 'QtGui/QAction' file not found ports wireshark 3 weeks 3 weeks
#50342 doxygen @1.8.10_2 does not build on PPC Tiger, Mac OS X 10.4.11, because of Python code error? ports doxygen 3 weeks 7 days
#50337 rbenv: Unable to verify file checksums ports rbenv 4 weeks 12 days
#50333 ffmpeg[-devel]: vulnerable to network attack ports ffmpeg ffmpeg-devel 4 weeks 4 weeks
#50332 [Port Abandoned] Ports maintained by css ports apg cmake cmake-devel Coin Coin-framework doxygen emacs-app emacs-app-devel glw hnb hrsh2csv inventor makeztxt mdbconv palm-db-tools pilot-link prc-tools rsync-lart simage SoXt streamripper tivodecode vtk44 4 weeks 4 weeks
#50326 defect: hugin-app can't find Lensfun at configure ports 4 weeks 4 weeks
#50324 ldns build fails - missing man pages? ports ldns 4 weeks 4 weeks
#50319 port request: 'python-oletools' ports 4 weeks 4 weeks
#50317 binwalk @2.0.1 Runtime warning about failing to load plugins ports binwalk 4 weeks 4 weeks
#50312 task @2.5.0_0: error: no type named 'shared_ptr' in namespace 'std' ports task 4 weeks 4 weeks
#50311 gmt5: build fails on Mavericks: error: conflicting types for 'dsyev_' ports gmt5 4 weeks 10 days
#50308 python27: Warning: configHandler.py - IdleConf.GetOption - problem retrieving configuration option 'name2' from section 'Theme'. ports python27 4 weeks 4 weeks
#50305 gtkglext @1.2.0 +quartz: error: X development libraries not found ports gtkglext 4 weeks 4 weeks
#50303 clasp @3.1.4: configure fails with universal variant ports clasp 4 weeks 4 weeks
#50301 py-scour @0.32: new submission ports py-scour 4 weeks 4 weeks
#50299 sshfs-gui: Not Visible in Finder ports sshfs-gui 4 weeks 4 weeks
#50295 fgsl fails to install ports fgsl 4 weeks 3 weeks
#50294 mlt upgrade ports mlt 4 weeks 4 weeks
#50293 [Port Abandoned] Ports maintained by mac.com:mdales ports tgif vtwm 4 weeks 4 weeks
#50290 postgresql95 @9.5.0 +universal configure phase fails ports postgresql95 4 weeks 4 weeks
#50288 UPDATE: gpsd-3.16 ports gpsd 4 weeks 6 days
#50282 py27-protobuf build fails ports py27-protobuf 4 weeks 9 days
#50281 qgis @2.12.0_1 build fails with fatal error: 'initializer_list' file not found ports qgis 4 weeks 3 weeks
#50280 arm-none-eabi-gcc @5.1.0_1 does not build on OS X Lion using clang ports arm-none-eabi-gcc 4 weeks 4 weeks
#50278 google-glog @0.3.3 updates to @0.3.4 and moved to github ports google-glog 4 weeks 4 weeks
#50271 CMake Portgroup: activate CMAKE_EXPORT_COMPILE_COMMANDS ports cmake 4 weeks 4 weeks
#50270 digikam @4.9.0 fails to build: lensfun.h:2506:5: error: templates must have C++ linkage ports digikam 4 weeks 4 weeks
#50269 qt4-mac @4.8.7_3: use of undeclared CoreWLAN identifiers ports qt4-mac 4 weeks 12 days
#50266 tgif: update to 4.2.5 ports tgif 4 weeks 4 weeks
#50262 octave port group: Remove orphaned paths ports octave 5 weeks 4 weeks
#50261 octave port group: Use cli for installs ports octave 5 weeks 4 weeks
#50259 zathura-plugin-pdf-mupdf @0.2.8 (office) Build failure - Undefined symbols for architecture x86_64 ports zathura-plugin-pdf-mupdf 5 weeks 5 weeks
#50254 harfbuzz-icu @1.1.2: error: unrecognized command line option "-std=c++0x" ports harfbuzz-icu 5 weeks 4 weeks
#50253 TeXShop3 @3.58: IconsPDF.iconset:error: Failed to generate ICNS ports TeXShop3 5 weeks 3 weeks
#50246 CMake PortGroup : generate a file in ${workpath} containing the complete cmake invocation ports 5 weeks 3 weeks
#50244 port upgrade outdated is unable to upgrade py34-setuptools ports py-setuptools 5 weeks 3 days
#50238 gpg2 can't connect to the agent specified in GPG_AGENT_INFO ports gnupg2 5 weeks 5 weeks
#50237 UPDATE: gpsd-3.15 ports gpsd 5 weeks 2 weeks
#50233 port upgrade --force shouldn't uninstall if no permission was given to install a missing dependency base 5 weeks 5 weeks
#50231 emacs-app does not emulate three-button mouse ports emacs-app 5 weeks 5 weeks
#50229 py-ngl: use compilers portgroup; update and download automatically ports py-ngl 5 weeks 2 weeks
#50227 port select --set ruby ruby23 fails on rake symlink creation ports ruby23 5 weeks 5 weeks
#50214 Update to wolfSSL (CyaSSL) Portfile ports cyassl wolfSSL 5 weeks 4 weeks
#50211 mapnik @3.0.9: build failure with undefined symbols ports mapnik 5 weeks 5 weeks
#50210 inkscape: Make python requirement optional ports inkscape inkscape-devel 5 weeks 5 weeks
#50209 VLC: Build failure ports vlc 5 weeks 5 weeks
#50207 shibboleth @2.5.5_0 fails to create mod_shib_24.so ports shibboleth 5 weeks 5 weeks
#50206 php-xdebug: add php70-xdebug subport ports php70-xdebug 5 weeks 46 hours
#50202 update samtools to 1.3 ports samtools 5 weeks 5 weeks
#50196 nodejs, nodejs-devel: don't conflict with iojs ports nodejs, nodejs-devel 5 weeks 5 weeks
#50194 http-parser @2.6.0 Adding new portfile ports http-parser 5 weeks 5 weeks
#50183 QtCurve ports: updates for Qt5 and KF5 ports QtCurve 6 weeks 6 weeks
#50182 gthumb hangs at start ports gthumb 6 weeks 6 weeks
#50181 install maven-ant-tasks fails ports maven-ant-tasks 6 weeks 5 weeks
#50180 osxfuse 2.8.2 fails to build with Xcode 7.2 on El Capitan (10.11.2) ports osxfuse 6 weeks 6 weeks
#50179 Error: Processing of port graphviz-gui failed ports graphviz-gui 6 weeks 6 weeks
#50178 pcre @8.38_0 checksum mismatch ports pcre 6 weeks 6 weeks
#50177 Error: Processing of port processing failed ports processing 6 weeks 6 weeks
#50171 Update or remove PyWavelets? ports py-pywavelets 6 weeks 6 weeks
#50168 Unable to selfupdate; rsync command works outside of ports base 6 weeks 6 weeks
#50164 wget: build fails on SL buildbot creating man page. ports wget 6 weeks 6 weeks
#50163 py-bob-learn-em: build fails on 10.8, error: no matching constructor for initialization of 'const std::map<std::string, bob::learn::em::KMeansTrainer::InitializationMethod>' ports py-bob-learn-em 6 weeks 6 weeks
#50162 py-bob-learn-boosting: build fails on 10.8, error: no member named 'hash_code' in 'std::type_info' ports py-bob-learn-boosting 6 weeks 6 weeks
#50161 py-bob-ip-gabor: build fails on 10.8, error: no matching constructor for initialization of 'const std::map<bob::ip::gabor::Similarity::SimilarityType, std::string>' ports py-bob-ip-gabor 6 weeks 6 weeks
#50160 py-bob-ip-base: build fails on 10.8, error: use of undeclared identifier 'isnan' ports py-bob-ip-base 6 weeks 6 weeks
#50158 panda: get a functional installation ports panda 6 weeks 3 days
#50157 ImageMagick: add HDRI support ports ImageMagick 6 weeks 6 weeks
#50153 MoarVM: upgrade and fix some issues ports MoarVM 6 weeks 6 weeks
#50152 libtommath: the released version is old ports libtommath 6 weeks 6 weeks
#50148 sudo port install kate goes to sleep on El Capitan 10.11.2 ports kate 6 weeks 6 weeks
#50147 lesspipe: update to 1.83 ports lesspipe 6 weeks 6 weeks
#50145 PHP70 not interpreted in Apache 2.2 ports apache2 6 weeks 5 weeks
#50143 new port: kf5-kwalletmanager ports 6 weeks 6 weeks
#50142 openfst 1.5.0: invalid checksum ports openfst 6 weeks 6 weeks
#50138 optpp: ld: framework not found vecLib ports optpp 6 weeks 6 weeks
#50135 php-memcached update to php70 ports php-memcached 6 weeks 45 hours
#50134 php-memcache update to php70 ports php-memcache 6 weeks 46 hours
#50133 php-Judy: add php70-Judy subport ports php-Judy 6 weeks 5 weeks
#50132 mrtg: update to 2.17.4 ports mrtg 6 weeks 6 weeks
#50131 zeroc-ice34 build failed on OS X 10.11.2 ports zeroc-ice34 6 weeks 6 weeks
#50128 tesseract @3.04.00_2 build failure: 'unordered_map' file not found ports tesseract 7 weeks 7 weeks
#50127 php-geoip: add php70-geoip subport ports php-geoip 7 weeks 7 weeks
#50121 submission: chrony NTP server ports chrony 7 weeks 3 weeks
#50119 LibreCAD 2.0.8_0.darwin failure on destroot ports LibreCAD 7 weeks 19 hours
#50118 tesseract-3.04.00 | Snow Leopard 10.6.8 | long integers in helper.h file ports tesseract 7 weeks 6 weeks
#50112 Processing of port failed: sqlite error: table registry.files has no column named mtime (1) while executing query: INSERT INTO registry.files (id, path, mtime, active) VALUES (?, ?, 0, 0) ports 7 weeks 6 weeks
#50110 Evince seg fault ports evince 7 weeks 6 weeks
#50100 clang-3.8 fails to support Boost.Python ports clang-3.8 boost python34 7 weeks 3 weeks
#50096 py35-openpyxl @2.3.1_0 missing dependency on module et_xmlfile ports py-openpyxl 7 weeks 5 weeks
#50094 new ports: kf5-{libkomparediff2,kompare} ports 7 weeks 7 weeks
#50093 Processing of port gnudatalanguage failed ports gnudatalanguage 7 weeks 4 weeks
#50092 povray @3.7.0.unofficial no image display while rendering ports povray 7 weeks 7 weeks
#50091 libsdl_image: grep: /opt/local/lib/libXext.la: No such file ports libsdl_image 7 weeks 5 days
#50087 libnetpbm failure ports libnetpbm 7 weeks 7 weeks
#50080 clang-3.8+universal fails to build ports clang-3.8 8 weeks 4 weeks
#50079 [Port Abandoned] Ports maintained by mac.com:mlund ports openbabel uade2 xmgr 8 weeks 8 weeks
#50078 [Port Abandoned] glabels ports glabels 8 weeks 8 weeks
#50077 [Port Abandoned] Ports maintained by noses.com:noses ports airport joe libesmtp trafshow 8 weeks 8 weeks
1 2 3 4 5 6 7 8 9 10 11 12
Note: See TracQuery for help on using queries.