New Ticket     Tickets     Wiki     Browse Source     Timeline     Roadmap     Ticket Reports     Search

Most Recent Active Tickets (3812 matches)

Filters
 
Or
 
  
 
Columns

Show under each result:


Results (501 - 600 of 3812)

1 2 3 4 5 6 7 8 9 10 11 12 13 14 15 16
Ticket Summary Component Port Created Modified
#45895 error building antlr ports antlr 5 months 5 months
#45893 atlas: build fails with "Atlas could not detect any fortran compiler" ports atlas 5 months 3 months
#45888 be: Bugs Everywhere has a missing dependency on py-jinja2 ports be 5 months 5 months
#45887 py-virtualenvwrapper: virtualenvwrapper_lazy.sh-2.7 is broken ports py-virtualenvwrapper 5 months 5 months
#45885 lang/bcpl ? ports 5 months 5 months
#45880 nu2 @2.0.1: error: garbage collection is no longer supported ports nu2 5 months 5 months
#45879 New port submission: belle-sip ports belle-sip 5 months 5 months
#45878 New port submission: antlr3c ports antlr3c 5 months 5 months
#45876 git: documentation files are not readable by normal user ports git 5 months 5 months
#45875 mysql56: install package-config `pc` file ports mysql56 5 months 5 months
#45873 root5: ImportError about __builtin__ on Python 3 ports root5 5 months 5 months
#45866 gnutls @3.3.10 fails to build ports gnutls, autoconf 5 months 5 months
#45862 New port: py-kde4 ports 5 months 4 months
#45861 Linphone-devel port is extremely outdated and should be removed ports linphone-devel 5 months 5 months
#45856 gnupg21: make new port, version 2.1.0 ports gnupg21 5 months 4 weeks
#45852 physfs @2.0.3 can't build on Leopard/PPC due to rpath (patch included) ports physfs 5 months 5 months
#45851 port should scan for DYLIB missing the TWOLEVEL flag base 5 months 4 months
#45849 darwinbuild update errors ports darwinbuild 5 months 3 months
#45845 mathgl package ports 5 months 13 days
#45839 nusmv @2.5.4_0: error: Header file "Solver_C.h" has not been found ports nusmv 5 months 5 months
#45836 nlopt: Please add nlopt port ports nlopt 5 months 5 months
#45835 MacPorts_Framework @1.2.1_1: error: garbage collection is no longer supported ports MacPorts_Framework 5 months 3 weeks
#45834 i386-elf-gcc @4.7.2 compile error with texinfo 5 ports i386-elf-gcc 5 months 5 months
#45832 defect: policykit 0.112_1 cannot be built on PPC Tiger and Leopard because it needs Clang 3.4 which cannot be built ports policykit 5 months 3 months
#45831 defect: emacs 24.4_1 cannot be built on PPC Tiger and Leopard because it needs Clang 3.4 which cannot be built ports emacs 5 months 5 months
#45826 db48 +java fails to configure without java ports db48 5 months 5 months
#45825 ledger @2.6.2_1: mv: rename *.elc to ../*.elc: No such file or directory ports ledger 5 months 5 months
#45823 [NEW]: rb21-fontcustom with dependent rb21 ports ports rb21-celluloid rb21-ffi rb21-fontcustom rb21-hitimes rb21-listen rb21-rb-fsevent rb21-rb-inotify rb21-thor rb21-timers 5 months 4 months
#45822 Issues when installing VLC-devel in a clean MacPorts install ports VLC-devel 5 months 5 months
#45811 gcc49: thread sanitizer is broken ports gcc49 5 months 5 months
#45807 py27-tkinter installation failed ports py27-tkinter 5 months 4 months
#45806 arm-none-eabi-gdb build failure on 10.10 Yosemite ports arm-none-eabi-gdb 5 months 3 weeks
#45804 py27-llvmmath @0.1.1_0: destroot fails with an assertion error ports py-llvmmath 5 months 5 months
#45803 mongodb @2.6.5_1: Run mongod instance with config file ports mongodb 5 months 3 months
#45799 Can't build encfs-1.7.5-135_2 on OSX 10.6.8 ports encfs 5 months 5 months
#45797 aalib @1.4rc5 fails to build ports aalib 5 months 5 months
#45796 yersinia: make: *** No rule to make target `all'. Stop. ports yersinia 5 months 5 months
#45795 llvm-3.4 fails to build with +ocaml variant ports llvm-3.4 5 months 3 months
#45791 geany: cannot open display ports geany 5 months 5 months
#45789 mysql-connector-java 5.1.12_0 command execution failed ports mysql-connector-java 5 months 5 months
#45786 Update mhddfs to 0.1.39 ports mhddfs 5 months 5 months
#45769 cfourcc: upstream mastersites not valid ports cfourcc 5 months 5 months
#45765 magit: staging into destroot failure: wrong type argument listp ports magit 5 months 5 months
#45762 id3v2 @0.1.12_1 wrong man page parsing ports id3v2 5 months 5 months
#45754 Add Facebook's osquery port ports 5 months 3 months
#45749 cloc @1.62 - new submission ports cloc 5 months 5 months
#45747 inkscape @0.48.5_4+python27+x11 fails to import images ports inkscape 5 months 5 months
#45745 soprano @2.9.4+universal fails on Yosemite ports soprano 5 months 5 months
#45744 [NEW] security/libcerror ports libcerror 5 months 4 months
#45743 [NEW] security/libcstring ports libcstring 5 months 4 months
#45740 reduce-algebra obsolete; replaced by reduce ports reduce-algebra 5 months 5 months
#45739 submission: reduce ports reduce 5 months 5 months
#45735 appledoc @2.2: error: garbage collection is no longer supported ports appledoc 5 months 5 months
#45734 gettext @0.19.3: compiling areadlink.c fails with "use of undeclared identifier 'AT_FDCWD'" ports gettext 5 months 5 months
#45712 xorg-libXt-1.1.4_0 links shared libs with -flat_namespace on Yosemite ports xorg-libXt 5 months 4 weeks
#45708 "port notes active" errors on deleted port base 5 months 5 months
#45693 py-cartopy: [reminder] update and add python 3.4 subport ports py-cartopy 5 months 5 months
#45690 eblook @1.6.1-media-20110801: error: use of undeclared identifier 'CPPFunction' ports eblook 5 months 5 months
#45689 Yosemite 10.10 Glade requirements not met ports glade 5 months 5 months
#45687 dfu-util to be used with Mac OS X 10.10 ports 5 months 5 months
#45685 cmake fails because of XML linking error (expat issue?) ports cmake 5 months 4 months
#45684 Builds hang post upgrading to Yosemite base 5 months 5 months
#45682 add java variant to vtk port ports vtk 5 months 5 months
#45681 libgcc @4.9.2: build fails with 10 parallel jobs ports libgcc 5 months 3 months
#45678 libquicktime @1.2.4: build failure ports libquicktime 5 months 5 months
#45676 vtk-devel: ld: 91 duplicate symbols for architecture x86_64 ports vtk-devel 5 months 4 months
#45675 cryptlib @3.4.2 fails to build on 10.10 with XCode 6.1 ports cryptlib 5 months 4 months
#45674 Misleading logging base 5 months 5 months
#45671 gtime @1.7_1 Doesn't install into libexec/gnubin ports gtime 5 months 5 months
#45670 InsightToolkit31{2,4}: retire old series 3.x versions ports InsightToolkit312 InsightToolkit314 5 months 5 months
#45669 db46 @4.6.21: libtool ports db46 5 months 5 months
#45665 ilmbase destroot error ports ilmbase 5 months 5 months
#45664 mecab-java linker error ports mecab-java 5 months 5 months
#45663 reaver in yosemite 10.10 could not work well ports reaver 5 months 5 months
#45658 chkrootkit distfiles unavalible ports chkrootkit 5 months 5 months
#45654 Update leiningen port from 2.1.3 to 2.5.0 ports leiningen 5 months 5 months
#45652 Request port of ghostscript 9.15 ports ghostscript 5 months 4 weeks
#45650 mailman 2.1.18-1 ports mailman 5 months 5 months
#45646 pulseaudio build fail after Yosemite upgrade ports pulseaudio 5 months 4 months
#45644 [NEW] analogi ports analogi 5 months 5 months
#45643 [UPDATE] libevt ports libevt 5 months 4 months
#45642 [NEW] py-yara ports py-yara 5 months 5 months
#45640 rom8x: new submission ports rom8x 5 months 5 months
#45639 Update wordpress dependencies ports wordpress 5 months 4 months
#45634 InsightToolkit @3.16.0_3: needs variant for newer Python ports InsightToolkit 5 months 5 months
#45629 cedet @1.1 fails to build on OS X Yosemite ports cedet 5 months 5 months
#45626 source-highlight @3.1.7 build failure ports source-highlight 5 months 5 months
#45625 QtCurve 1.8.18_0 fails to build on Snow Leopard ports qtcurve 5 months 4 months
#45624 Failed to install gimp-jp2 ports gimp-jp2 5 months 5 months
#45622 Trac - use subticket plugin wiki 5 months 5 months
#45621 unison @2.40.102_2 crashes ports unison ocaml 5 months 2 months
#45620 Libpcap 1.6.2 can't be installed without bison ports libpcap 5 months 5 months
#45617 abinit 7.8.2: use of port groups ports abinit 5 months 5 months
#45616 Compile error with g++ 4.8.2 ports boost 5 months 5 months
#45612 Failed to Install SoXt on Yosemite ports SoXt 5 months 5 months
#45604 request: zbar ports 5 months 3 months
#45599 cairo runtime messages/crash regarding obsolete CGFontGetGlyphPath ports cairo 5 months 4 months
#45592 port upgrade outdated fails ports 5 months 5 months
#45585 Yosemite py27-cython installs but does not function properly. Hasfix ports py27-cython 5 months 5 months
#45582 grace: xmgrace crashes with SIGSYS in yosemite ports grace t1lib 5 months 5 days
1 2 3 4 5 6 7 8 9 10 11 12 13 14 15 16
Note: See TracQuery for help on using queries.