New Ticket     Tickets     Wiki     Browse Source     Timeline     Roadmap     Ticket Reports     Search

Custom Query (37624 matches)

Filters
 
Or
 
  
 
Columns

Show under each result:


Results (20901 - 21000 of 37624)

Ticket Summary Owner Type Priority Milestone Component
#40975 opam @1.0.0_1 Checksum error mww@… defect Normal ports

Reported by moo.macports.z.edmcman@…, 17 months ago.

Description

It seems like the opam project has changed the checksum of their 1.0.0 release:

Users/ed] > clean --all opam
--->  Cleaning opam
[Users/ed] > install opam
--->  Computing dependencies for opam
--->  Fetching archive for opam
--->  Attempting to fetch opam-1.0.0_1.darwin_13.x86_64.tbz2 from http://lil.fr.packages.macports.org/opam
--->  Attempting to fetch opam-1.0.0_1.darwin_13.x86_64.tbz2 from http://mse.uk.packages.macports.org/sites/packages.macports.org/opam
--->  Attempting to fetch opam-1.0.0_1.darwin_13.x86_64.tbz2 from http://packages.macports.org/opam
--->  Fetching distfiles for opam
--->  Attempting to fetch opam-1.0.0.tar.gz from https://github.com/OCamlPro/opam/tarball/1.0.0
--->  Attempting to fetch cmdliner-0.9.3.tbz from http://ykf.ca.distfiles.macports.org/MacPorts/mpdistfiles/opam
--->  Attempting to fetch cudf-0.6.3.tar.gz from http://ykf.ca.distfiles.macports.org/MacPorts/mpdistfiles/opam
--->  Attempting to fetch dose3-3.1.2.tar.gz from http://ykf.ca.distfiles.macports.org/MacPorts/mpdistfiles/opam
--->  Attempting to fetch extlib-1.5.3.tar.gz from http://ocaml-extlib.googlecode.com/files/
--->  Attempting to fetch ocaml-re-1.2.0.tar.gz from https://github.com/ocaml/ocaml-re/archive/
--->  Attempting to fetch ocamlgraph-1.8.1.tar.gz from http://ykf.ca.distfiles.macports.org/MacPorts/mpdistfiles/opam
--->  Verifying checksums for opam
Error: Checksum (rmd160) mismatch for opam-1.0.0.tar.gz
Error: Checksum (sha256) mismatch for opam-1.0.0.tar.gz
Error: org.macports.checksum for port opam returned: Unable to verify file checksums
Please see the log file for port opam for details:
    /opt/local/var/macports/logs/_opt_local_var_macports_sources_rsync.macports.org_release_tarballs_ports_sysutils_opam/opam/main.log
To report a bug, follow the instructions in the guide:
    http://guide.macports.org/#project.tickets
Error: Processing of port opam failed

main.log is attached.

#45548 opam version 1.1.2 required for compiling with ocaml 4.02.1 mww@… defect Normal ports

Reported by garrigue@…, 5 months ago.

Description

ocaml has been updated to 4.02.0 (and now 4.02.1), but this breaks some dependent ports. One of them is opam, which has to be updated to 1.1.2. An extra target is also needed to build it. Here are the changed lines in the port file:

github.setup ocaml opam 1.1.2
checksums rmd160 0e9593e38aa13bc57a22028d19166bfcf67d0426 \

sha256 f7a8dee6c67cd1e7503c179a9a5b139220085b9ed7d80e6ec838a8a344cb4c71

build.target lib-ext all

#26429 openal 1.0 / 1.1 failing to build on 10.6 macports-tickets@… defect Normal ports

Reported by gjznituv@…, 5 years ago.

Description

It failed with the latest port file as of now, and also after I applied the updated patch at #13587 :

--->  Attempting to fetch openal-1.1.tar.bz2 from http://svn.macports.org/repository/macports/distfiles/openal
--->  Verifying checksum(s) for openal
--->  Extracting openal
--->  Configuring openal
--->  Building openal
Error: Target org.macports.build returned: shell command failed
Log for openal is at: /opt/local/var/macports/logs/_opt_local_var_macports_sources_rsync.macports.org_release_ports_audio_openal/main.log

last lines in the log:

:info:build shell command " cd "/opt/local/var/macports/build/_opt_local_var_macports_sources_rsync.macports.org_release_ports_audio_openal/work/openal-1.1/OpenAL-MacOSX" && /usr/bin/xcodebuild -configuration Deployment -project OpenAL.xcodeproj " returned error 1
:error:build Target org.macports.build returned: shell command failed
:debug:build Backtrace: shell command failed
    while executing
"command_exec build"
    (procedure "portbuild::build_main" line 8)
    invoked from within
"$procedure $targetname"
:info:build Warning: the following items did not execute (for openal): org.macports.activate org.macports.build org.macports.destroot org.macports.install
:notice:build Log for openal is at: /opt/local/var/macports/logs/_opt_local_var_macports_sources_rsync.macports.org_release_ports_audio_openal/main.log

#39008 OpenAL @1.3: build failure on Mountain Lion: missing header: CAStreamBasicDescription.h macports-tickets@… defect Normal ports

Reported by egall@…, 2 years ago.

Description

recently tried installing MacPorts's OpenAL, ran into the following error:

In file included from /opt/local/var/macports/build/_opt_local_var_macports_sources_rsync.macports.org_release_tarballs_ports_audio_openal/openal/work/openal-1.3/OpenAL-MacOSX/oalImp.cpp:27:
In file included from /opt/local/var/macports/build/_opt_local_var_macports_sources_rsync.macports.org_release_tarballs_ports_audio_openal/openal/work/openal-1.3/OpenAL-MacOSX/oalImp.h:29:
/opt/local/var/macports/build/_opt_local_var_macports_sources_rsync.macports.org_release_tarballs_ports_audio_openal/openal/work/openal-1.3/OpenAL-MacOSX/oalOSX.h:32:10: fatal error: 'CAStreamBasicDescription.h' file not found
#include "CAStreamBasicDescription.h"
         ^
1 error generated.

Full log is attached. Also this port has no maintainer.

#29577 openal 1.3 does not build on Mac OS 10.4.11 Intel macports-tickets@… defect Normal ports

Reported by rudloff@…, 4 years ago.

Description
Rudloff:~ Pierre$ sudo port install openal
--->  Building openal
Error: Target org.macports.build returned: shell command failed (see log for details)
Log for openal is at: /opt/local/var/macports/logs/_opt_local_var_macports_sources_rsync.macports.org_release_ports_audio_openal/main.log
Error: Status 1 encountered during processing.
To report a bug, see <http://guide.macports.org/#project.tickets>
#2791 openal build fails mww@… defect Normal ports

Reported by digitalsin@…, 10 years ago.

Description

Upon clean install of Darwin Ports on an Apple G4 PowerMac, openal build fails! :( Please someone have any patches or can help?

It is fetching openal-2004-08-10.tar.bz2 from http://www.opendarwin.org/~mww/files/

Here are the developer/os version and the error output at the end.

Mac OSX 10.3.8 Panther: Darwin host 7.8.0 Darwin Kernel Version 7.8.0: Wed Dec 22 14:26:17 PST 2004; root:xnu/xnu -517.11.1.obj~1/RELEASE_PPC Power Macintosh powerpc

Xtools 1.5


gcc with c++ patch from Apple Developer Site: (gcc/g++); gcc version 3.3 20030304 (Apple Computer, Inc. build 1671) (ld); Apple Computer, Inc. version cctools-525.1.obj~8

Actual build error:


oalDevice.cpp: In member function `void OALDevice::InitializeGraph(const char*)': oalDevice.cpp:235: error: `MixerDistanceParams' undeclared (first use this function) oalDevice.cpp:235: error: (Each undeclared identifier is reported only once for each function it appears in.) oalDevice.cpp:235: error: parse error before `;' token oalDevice.cpp:237: error: `kAudioUnitProperty_3DMixerDistanceParams' undeclared (first use this function) oalDevice.cpp:237: error: `distanceParams' undeclared (first use this function) ...failed CompileCplusplus /Users/jonaslaurio/darwinports/dports/audio/openal/work/openal/ macosx/build/al_osx.build/openal.dylib.build/Objects-normal/ppc/oalDevice.o ... BUILD FAILED

#12947 openal endianness macports-tickets@… defect Normal ports

Reported by maddanio@…, 7 years ago.

Description

openal bult on my intel macbook seems to have an endianness issue (you can tell as sounds are mostly distoted, except when they go really quiet, which suggests that only 8bit sounds play correctly).

#26213 OpenAL fails to build on OS X 10.6 macports-tickets@… defect Normal ports

Reported by ionic@…, 5 years ago.

Description
--->  Dependencies to be installed: openal
--->  Building openal
(NOTE: project al_osx was written by an older Xcode version (39) -- temporarily upgrading it (without modifying project file))


=== BUILD LIBRARY TARGET openal.dylib OF PROJECT al_osx WITH THE DEFAULT CONFIGURATION (Default) ===
Check dependencies
Jam is deprecated and has been removed; targets that use Jam must be upgraded to native targets. For more information on doing this, consult the Xcode documentation.
Jam is deprecated and has been removed; targets that use Jam must be upgraded to native targets. For more information on doing this, consult the Xcode documentation.
** BUILD FAILED **

shell command " cd "/opt/local/var/macports/build/_opt_local_var_macports_sources_macports.rsync.ionic.de_release_ports_audio_openal/work/openal-1.0/macosx" && /usr/bin/xcodebuild -project al_osx.xcode " returned error 1
Error: Target org.macports.build returned: shell command failed
Warning: the following items did not execute (for openal): org.macports.activate org.macports.build org.macports.destroot org.macports.install
Log for openal is at: /opt/local/var/macports/logs/_opt_local_var_macports_sources_macports.rsync.ionic.de_release_ports_audio_openal/main.log
Error: The following dependencies failed to build: openal
Error: Status 1 encountered during processing.

Seems like the makefile is broken here. :/

#37895 openal: fatal error: 'CAStreamBasicDescription.h' file not found macports-tickets@… defect Normal ports

Reported by philippe.groarke@…, 2 years ago.

Description

This may be duplicate of #34012. Attached is log file of a first try.

#14920 openal port build failure macports-tickets@… defect Normal ports

Reported by shaene@…, 7 years ago.

Description

Building in Leopard fails because CADebugMacros.cp does not exist. CADebugMacros.cpp is what it's looking for, so I copied it and named it CADebugMacros.cp. Build was successful.

#27592 openal-soft @1.11.753 new port ryandesign@… submission Normal ports

Reported by frederic.devernay@…, 4 years ago.

Description

Apple's OpenAL (version 1.2) or the one included in MacPorts (1.3) are missing the multichannel extensions that are available on windows or Linux through OpenAL-soft. This port installs a fork from OpenAL-soft that implements rendering on coreaudio, and includes multichannel support. This fork does not seem to be actively maintained, but at least this gives portable multichannel support on MacOSX (i.e. not through MacOSX-specific extensions).

#13587 openal: update to 1.1 macports-tickets@… update Normal ports

Reported by redmage.spkelly@…, 7 years ago.

Description

nox already caught the issue with the MacPorts OpenAL package itself, but the fix doesn't seem to have made the fetch source list. An older version of MacPorts was able to find the 1.0 source at an old mirror, the latest MacPorts can't find any 1.0 sources and the 1.1 version doesn't even show up on a search.

#4224 openbabel-1.100.2 build fails with libtool internal error on Mac OS 10.4.2 macports-tickets@… defect Normal ports

Reported by npumfrey@…, 10 years ago.

Description

Link phase of the build is as follows: ---> Building openbabel with target all Error: Target com.apple.build returned: shell command "cd "/opt/local/var/db/dports/build/ file._opt_local_var_db_dports_sources_rsync.rsync.opendarwin.org_dpupdate_dports_science_openbabe l/work/openbabel-1.100.2" && make all" returned error 2 Command output: Making all in src make all-recursive Making all in math make[3]: Nothing to be done for `all'. Making all in windows make[3]: Nothing to be done for `all'. /bin/sh ../libtool --mode=link g++ -g -O2 -o libopenbabel.la -rpath /opt/local/lib -version-info 0:0:0 alchemy.lo amber.lo atom.lo balst.lo base.lo bgf.lo binary.lo bitvec.lo bond.lo box.lo c3d.lo cacao.lo cache.lo car.lo ccc.lo chains.lo chdrw.lo chemtool.lo chiral.lo cml.lo crk.lo csr.lo cssr.lo data.lo dmol.lo feat.lo fh.lo fileformat.lo gamess.lo gaussian.lo generic.lo ghemical.lo grid.lo gromos96.lo hin.lo jaguar.lo matrix.lo mdl.lo mm3.lo mmod.lo mol.lo mol2.lo molchrg.lo molvector.lo mopac.lo mpqc.lo nwchem.lo oberror.lo obutil.lo parsmart.lo parsmi.lo patty.lo pdb.lo phmodel.lo povray.lo qchem.lo rand.lo report.lo residue.lo ring.lo rotor.lo shelx.lo smi.lo tinker.lo tokenst.lo typer.lo unichem.lo viewmol.lo xed.lo xyz.lo zindo.lo pqs.lo math/libmath.la -lm g++ -dynamiclib -single_module -flat_namespace -undefined suppress -o .libs/libopenbabel. 0.0.0.dylib .libs/alchemy.o .libs/amber.o .libs/atom.o .libs/balst.o .libs/base.o .libs/bgf.o .libs/ binary.o .libs/bitvec.o .libs/bond.o .libs/box.o .libs/c3d.o .libs/cacao.o .libs/cache.o .libs/car.o .libs/ ccc.o .libs/chains.o .libs/chdrw.o .libs/chemtool.o .libs/chiral.o .libs/cml.o .libs/crk.o .libs/csr.o .libs/ cssr.o .libs/data.o .libs/dmol.o .libs/feat.o .libs/fh.o .libs/fileformat.o .libs/gamess.o .libs/ gaussian.o .libs/generic.o .libs/ghemical.o .libs/grid.o .libs/gromos96.o .libs/hin.o .libs/jaguar.o .libs/ matrix.o .libs/mdl.o .libs/mm3.o .libs/mmod.o .libs/mol.o .libs/mol2.o .libs/molchrg.o .libs/ molvector.o .libs/mopac.o .libs/mpqc.o .libs/nwchem.o .libs/oberror.o .libs/obutil.o .libs/ parsmart.o .libs/parsmi.o .libs/patty.o .libs/pdb.o .libs/phmodel.o .libs/povray.o .libs/qchem.o .libs/ rand.o .libs/report.o .libs/residue.o .libs/ring.o .libs/rotor.o .libs/shelx.o .libs/smi.o .libs/ tinker.o .libs/tokenst.o .libs/typer.o .libs/unichem.o .libs/viewmol.o .libs/xed.o .libs/xyz.o .libs/ zindo.o .libs/pqs.o -all_load math/.libs/libmath.a -lm -install_name /opt/local/lib/libopenbabel. 0.dylib -compatibility_version 1 -current_version 1.0 ld: warning -undefined suppress disables -prebind ld: warning multiple definitions of symbol _eprintf /usr/lib/gcc/powerpc-apple-darwin8/4.0.0/libgcc.a(_eprintf.o) private external definition of _eprintf in section (TEXT,text) /usr/lib/gcc/powerpc-apple-darwin8/4.0.0/libstdc++.dylib(single module) definition of _eprintf ld: multiple definitions of symbol _divdi3 /usr/lib/gcc/powerpc-apple-darwin8/4.0.0/libgcc.a(_divdi3.o) private external definition of _divdi3 in section (TEXT,text) /usr/lib/gcc/powerpc-apple-darwin8/4.0.0/libgcc_s.dylib(_divdi3.o) definition of _divdi3 ld: multiple definitions of symbol _udivdi3 /usr/lib/gcc/powerpc-apple-darwin8/4.0.0/libgcc.a(_udivdi3.o) private external definition of _udivdi3 in section (TEXT,text) /usr/lib/gcc/powerpc-apple-darwin8/4.0.0/libgcc_s.dylib(_udivdi3.o) definition of _udivdi3 ld: multiple definitions of symbol _umoddi3 /usr/lib/gcc/powerpc-apple-darwin8/4.0.0/libgcc.a(_umoddi3.o) private external definition of _umoddi3 in section (TEXT,text) /usr/lib/gcc/powerpc-apple-darwin8/4.0.0/libgcc_s.dylib(_umoddi3.o) definition of _umoddi3 /usr/bin/libtool: internal link edit command failed make[3]: * [libopenbabel.la] Error 1 make[2]: * [all-recursive] Error 1 make[1]: * [all] Error 2 make: * [all-recursive] Error 1

#16228 openbabel 2.2.0 update ryandesign@… update Normal ports

Reported by mlund@…, 7 years ago.

Description

Update from 2.1.1->2.2.0

#22216 openbabel-2.2.0 update to 2.2.3 beatrupp@… update Normal ports

Reported by mlund@…, 5 years ago.

Description

2.2.0 -> 2.2.3

#28487 openbabel 2.3.0 version update beatrupp@… update Normal ports

Reported by mlund@…, 4 years ago.

Description

Update openbabel from 2.2.3 to. 2.3.0. The build system has changed from autotools to cmake and I have changed the maintainer to me as well as set the "openmaintainer" address (the original maintainer has not reponded to updates for the past three years).

I am not maintaining the "py26-openbabel" package but that probably needs updating. Would it be a good idea to have the python module as a variant in "openbabel"? Not quite sure how to do that, so help would in that case be needed.

#39744 openbabel @2.3.1: Add to chemistry category larryv@… enhancement Normal ports

Reported by c.herbig@…, 21 months ago.

Description

Append chemistry to categories so that it will show up in the chemistry category.

#41335 openbabel 2.3.1 doesn't compile in Mavericks mlund@… update Normal ports

Reported by gezelter@…, 17 months ago.

Description

The openbabel 2.3.1 port depends on eigen (which doesn't compile on Mavericks), and has a few C++11 oddities in include files that prevent compilation even with eigen3. The modified port file and 5 patches fix compilation on Mavericks and bump openbabel to 2.3.2.

#39774 openbabel @2.3.1 missing dependency on wxwidgets-(devel,3.0) mlund@… defect Normal ports

Reported by ba306@…, 21 months ago.

Description

Hi, Trying to install python bindings for openbabel. Mac lion. Have been working on this for 4 days now! most recent error:

version:1
:debug:main Executing org.macports.main (openbabel)
:debug:main changing euid/egid - current euid: 0 - current egid: 0
:debug:main egid changed to: 501
:debug:main euid changed to: 502
:debug:main Skipping completed org.macports.archivefetch (openbabel)
:debug:main Privilege de-escalation not attempted as not running as root.
:debug:main Skipping completed org.macports.fetch (openbabel)
:debug:main Privilege de-escalation not attempted as not running as root.
:debug:main Skipping completed org.macports.checksum (openbabel)
:debug:main Privilege de-escalation not attempted as not running as root.
:debug:main Skipping completed org.macports.extract (openbabel)
:debug:main Privilege de-escalation not attempted as not running as root.
:debug:main Skipping completed org.macports.patch (openbabel)
:debug:main Privilege de-escalation not attempted as not running as root.
:debug:configure configure phase started at Wed Jul 17 12:14:16 BST 2013
:notice:configure --->  Configuring openbabel
:debug:configure Using compiler 'Mac OS X clang'
:debug:configure Executing proc-pre-org.macports.configure-configure-0
:debug:configure Executing org.macports.configure (openbabel)
:debug:configure Environment: CPATH='/opt/local/include' CFLAGS='-pipe -O2 -arch x86_64' CPPFLAGS='-I/opt/local/include' CXXFLAGS='-pipe -O2 -arch x86_64' LIBRARY_PATH='/opt/local/lib' MACOSX_DEPLOYMENT_TARGET='10.7' CXX='/usr/bin/clang++' CC_PRINT_OPTIONS_FILE='/opt/local/var/macports/build/_opt_local_var_macports_sources_rsync.macports.org_release_tarballs_ports_science_openbabel/openbabel/work/.CC_PRINT_OPTIONS' F90FLAGS='-pipe -O2 -m64' LDFLAGS='-L/opt/local/lib -arch x86_64' OBJC='/usr/bin/clang' FCFLAGS='-pipe -O2 -m64' INSTALL='/usr/bin/install -c' OBJCFLAGS='-pipe -O2 -arch x86_64' FFLAGS='-pipe -O2 -m64' CC_PRINT_OPTIONS='YES' CC='/usr/bin/clang'
:debug:configure Assembled command: 'cd "/opt/local/var/macports/build/_opt_local_var_macports_sources_rsync.macports.org_release_tarballs_ports_science_openbabel/openbabel/work/openbabel-2.3.1" && /opt/local/bin/cmake -DCMAKE_INSTALL_PREFIX=/opt/local -DCMAKE_VERBOSE_MAKEFILE=ON -DCMAKE_COLOR_MAKEFILE=ON -DCMAKE_BUILD_TYPE=Release -DCMAKE_BUILD_WITH_INSTALL_RPATH=ON -DCMAKE_INSTALL_NAME_DIR=/opt/local/lib -DCMAKE_SYSTEM_PREFIX_PATH="/opt/local;/usr" -DCMAKE_MODULE_PATH=/opt/local/share/cmake/modules -DCMAKE_FIND_FRAMEWORK=LAST -Wno-dev -DBUILD_GUI=OFF -DBUILD_TESTING=OFF -DPYTHON_BINDINGS=OFF -DCMAKE_OSX_ARCHITECTURES="x86_64" -DCMAKE_OSX_SYSROOT=/ -DCMAKE_OSX_DEPLOYMENT_TARGET=""'
:debug:configure Executing command line:  cd "/opt/local/var/macports/build/_opt_local_var_macports_sources_rsync.macports.org_release_tarballs_ports_science_openbabel/openbabel/work/openbabel-2.3.1" && /opt/local/bin/cmake -DCMAKE_INSTALL_PREFIX=/opt/local -DCMAKE_VERBOSE_MAKEFILE=ON -DCMAKE_COLOR_MAKEFILE=ON -DCMAKE_BUILD_TYPE=Release -DCMAKE_BUILD_WITH_INSTALL_RPATH=ON -DCMAKE_INSTALL_NAME_DIR=/opt/local/lib -DCMAKE_SYSTEM_PREFIX_PATH="/opt/local;/usr" -DCMAKE_MODULE_PATH=/opt/local/share/cmake/modules -DCMAKE_FIND_FRAMEWORK=LAST -Wno-dev -DBUILD_GUI=OFF -DBUILD_TESTING=OFF -DPYTHON_BINDINGS=OFF -DCMAKE_OSX_ARCHITECTURES="x86_64" -DCMAKE_OSX_SYSROOT=/ -DCMAKE_OSX_DEPLOYMENT_TARGET="" 
:info:configure -- Using included inchi library.
:info:configure -- Could NOT find wxWidgets (missing:  wxWidgets_FOUND) 
:info:configure CMake Error at /opt/local/share/cmake-2.8/Modules/FindPackageHandleStandardArgs.cmake:97 (message):
:info:configure   Could NOT find PkgConfig (missing: PKG_CONFIG_EXECUTABLE)
:info:configure Call Stack (most recent call first):
:info:configure   /opt/local/share/cmake-2.8/Modules/FindPackageHandleStandardArgs.cmake:291 (_FPHSA_FAILURE_MESSAGE)
:info:configure   /opt/local/share/cmake-2.8/Modules/FindPkgConfig.cmake:102 (find_package_handle_standard_args)
:info:configure   cmake/modules/FindCairo.cmake:23 (find_package)
:info:configure   CMakeLists.txt:404 (find_package)
:info:configure 
:info:configure 
:info:configure -- Configuring incomplete, errors occurred!
:info:configure Command failed:  cd "/opt/local/var/macports/build/_opt_local_var_macports_sources_rsync.macports.org_release_tarballs_ports_science_openbabel/openbabel/work/openbabel-2.3.1" && /opt/local/bin/cmake -DCMAKE_INSTALL_PREFIX=/opt/local -DCMAKE_VERBOSE_MAKEFILE=ON -DCMAKE_COLOR_MAKEFILE=ON -DCMAKE_BUILD_TYPE=Release -DCMAKE_BUILD_WITH_INSTALL_RPATH=ON -DCMAKE_INSTALL_NAME_DIR=/opt/local/lib -DCMAKE_SYSTEM_PREFIX_PATH="/opt/local;/usr" -DCMAKE_MODULE_PATH=/opt/local/share/cmake/modules -DCMAKE_FIND_FRAMEWORK=LAST -Wno-dev -DBUILD_GUI=OFF -DBUILD_TESTING=OFF -DPYTHON_BINDINGS=OFF -DCMAKE_OSX_ARCHITECTURES="x86_64" -DCMAKE_OSX_SYSROOT=/ -DCMAKE_OSX_DEPLOYMENT_TARGET="" 
:info:configure Exit code: 1
:error:configure org.macports.configure for port openbabel returned: configure failure: command execution failed
:debug:configure Error code: NONE
:debug:configure Backtrace: configure failure: command execution failed
    while executing
"$procedure $targetname"
:info:configure Warning: targets not executed for openbabel: org.macports.activate org.macports.configure org.macports.build org.macports.destroot org.macports.install
:error:configure Failed to install openbabel
:debug:configure couldn't open "/System/Library/Frameworks/Tcl.framework/Versions/8.5/Resources/tclIndex": no such file or directory
    while executing
"open [file join $dir tclIndex]"
:notice:configure Please see the log file for port openbabel for details:
    /opt/local/var/macports/logs/_opt_local_var_macports_sources_rsync.macports.org_release_tarballs_ports_science_openbabel/openbabel/main.log
#4030 OpenBabel fails to Install olegb@… defect Normal ports

Reported by steve.constable@…, 10 years ago.

Description

I ran port install openbabel on my Tiger installation. Breaks with error: /usr/bin/libtool: internal link edit command failed make[3]: * [libopenbabael.la] Error 1 make[2]: * [all-recursive] Error 1 make[1]: * [all] Error 2 make: * [all-recursive] Error 1

#38380 OpenBabel missing dependency mlund@… defect Normal ports

Reported by tantrev@…, 2 years ago.

Description

OpenBabel appears to be missing a dependency on "pkgconfig". I just tried installing it on a clean Mac OS Mountain Lion install and that was causing issues. installing "pkgconfig" fixed the issue.

Thank you!

#33238 openbabel: update to 2.3.1 mlund@… update Normal ports

Reported by zach.charlop.powers@…, 3 years ago.

Description

there is a new version of openbabel that suports a few nice new features including writing PNG files

#40592 openblas: fails to build with avx instructions nicos@… defect Normal ports

Reported by Deil.Christoph@…, 18 months ago.

Description

For Mac OS X 10.8 with XCode 5 and the gcc 4.7 openblas variant the build fails with errors such as

no such instruction: `vxorpd %xmm0, %xmm0,%xmm0'

Full log: https://gist.github.com/cdeil/6711021

#46684 OpenBLAS: gcc4{5,6,7,8,9} variants seem to be brocken nicos@… defect Normal ports

Reported by petr@…, 2 months ago.

Description

OpenBLAS provides various compiler variants, but the gcc seem to be at least for the tested versions 4.7, 4.8 and 4.9.

OpenBLAS @0.2.13 (math, science)
Variants:             [+]clang, gcc45, gcc46, gcc47, gcc48, gcc49, lapack, universal

Description:          OpenBLAS is an optimized BLAS library based on GotoBLAS2
Homepage:             https://github.com/xianyi/OpenBLAS

Build Dependencies:   dragonegg-3.3-gcc-4.8
Conflicts with:       OpenBLAS-devel
Platforms:            darwin
License:              BSD
Maintainers:          nicos@macports.org, openmaintainer@macports.org

The error reported boils down to:

[...]
/opt/local/var/macports/build/_opt_local_var_macports_sources_rsync.macports.org_release_tarballs_ports_math_OpenBLAS/OpenBLAS/work/.tmp/ccKpAOjH.s:13:no such instruction: `vmovss (%rsi), %xmm0'
[...]

so it is likely to be related to #40592. If there is not intention to fix gcc compilation, these variants should probably be removed.

#26715 openbox @3.4.5 Upgrade to version @3.4.11.2 afb@… update Normal ports
#43191 openbrowser: remove hardcoded "Perl 5.12" dependency ryandesign@… enhancement Normal ports

Reported by mojca@…, 12 months ago.

Description

When trying to remove Perl 5.12 packages from my system, I found out that through a long dependency list openbrowser was installed which requires

depends_run port:p5.12-mac-propertylist

It would be great to change the port in such a way that any perl version could satisfy the dependency, in particular now when 5.16 became the default version.

#21044 openbrowser: stop using p5-mac-carbon ryandesign@… defect Normal ports

Reported by ryandesign@…, 6 years ago.

Description

openbrowser uses p5-mac-carbon's Mac::InternetConfig module to read the name of the user's web browser. But p5-mac-carbon doesn't build on Snow Leopard and the software is not maintained upstream. Find a way for openbrowser to get the browser name without using Mac::Carbon.

#25738 opencdk universal build fails when dependencies aren't universal macports-tickets@… defect Normal ports

Reported by dersh@…, 5 years ago.

Description

I was trying to upgrade wine-devel, which has a dependency on opencdk. So macports tried to install opencdk, but gives an odd error. It appears that it does first install:

--->  Computing dependencies for opencdk
--->  Fetching opencdk
--->  Attempting to fetch opencdk-0.6.6.tar.bz2 from http://distfiles.macports.org/opencdk
--->  Verifying checksum(s) for opencdk
--->  Extracting opencdk
--->  Configuring opencdk
--->  Building opencdk
--->  Staging opencdk into destroot
--->  Installing opencdk @0.6.6_0
--->  Activating opencdk @0.6.6_0
--->  Cleaning opencdk

But later tries to reinstall and gives an error:

--->  Computing dependencies for wine-devel
--->  Dependencies to be installed: gnutls lzo opencdk
--->  Fetching lzo
--->  Verifying checksum(s) for lzo
--->  Extracting lzo
--->  Configuring lzo
--->  Building lzo
--->  Staging lzo into destroot
--->  Installing lzo @1.08_0+universal
--->  Deactivating lzo @1.08_0
--->  Cleaning lzo
--->  Activating lzo @1.08_0+universal
--->  Cleaning lzo
--->  Fetching opencdk
--->  Verifying checksum(s) for opencdk
--->  Extracting opencdk
--->  Configuring opencdk
--->  Building opencdk
Error: Target org.macports.build returned: shell command failed
Log for opencdk is at: /opt/local/var/macports/logs/_opt_local_var_macports_sources_rsync.macports.org_release_ports_devel_opencdk/main.log
Error: The following dependencies failed to build: gnutls opencdk
Error: Unable to upgrade port: 1
To report a bug, see <http://guide.macports.org/#project.tickets>

It was suggested that perhaps it is first installing non-universal, then tries to upgrade to universal and that fails. I will attached log that is generated as well.

Thanks,

#27805 openconnect @2.25_1 gconf is not necessary to build the port Mathias.Laurin+macports@… defect Normal ports

Reported by chris.walter@…, 4 years ago.

Description

Although gconf is not necessary to build openconnect (it is necessary if you want to support network-manager in gnome) is is included in the dependencies.

This causes a lot of gnome libraries to be brought in unnecessarily which for many users in unneeded. I confirmed that if you remove it from the port file openconnect still works fine.

From the web page(http://www.infradead.org/openconnect/):

"For building the NetworkManager support, you will also need: GTK GConf"

Could this be put in a variant (if network-manager is even possible in macports) or removed?

Thanks for this port!

#27809 openconnect @2.25 updated to @2.26 macports-tickets@… update Normal ports

Reported by Mathias.Laurin+macports@…, 4 years ago.

Description

Here is the list of modifications made to the Portfile:

  • add openmaintainer to the maintainers
  • remove gconf from depends_lib, fix Ticket #27805
  • replace the patch to the Makefile with reinplace macros
  • openconnect now needs build.target on OS X as the author added something else (may be support for network-manager in gnome, I am not using gnome on OS X, I will not try to add a gnome variant)
  • livecheck actually works
#37682 openconnect 3.18 outdated and buggy macports-tickets@… update Normal ports

Reported by edestecd@…, 2 years ago.

Description

Version 3.18 does not work on OSX 10.8 Mountain Lion. Outgoing packets are not forwarded through the tunnel.

I have compiled from source and verified that the newest version from http://www.infradead.org/openconnect/download.html works correctly on osx 10.8.

Please update to version 4.07 or newer.

#37959 openconnect @3.18 update to latest 4.07 ryandesign@… update Normal ports

Reported by xcompass@…, 2 years ago.

Description

Updated version and hashes

#38725 openconnect @4.07 update to latest 4.08 ryandesign@… update Normal ports
#39308 openconnect @4.08 update to latest 5.01 macports-tickets@… update Normal ports

Reported by xcompass@…, 22 months ago.

Description

Update openconnect to 5.01

#47109 openconnect @7.01_0: update to 7.05 larryv@… update Normal ports

Reported by bjorn.ketelaars@…, 3 weeks ago.

Description

Update openconnect to the latest version (7.05). Changelog can be found at http://www.infradead.org/openconnect/changelog.html

#27840 openconnect needs to support changing build_arch Mathias.Laurin+macports@… defect Normal ports

Reported by ryandesign@…, 4 years ago.

Description

openconnect fails to build if the user has changed build_arch in macports.conf to a non-default value. Because this port does not use a standard configure phase, it must take care of the build_arch settings in the build phase manually. There are several portfiles you can use as examples of how this is done.

#31237 openconnect new version 3.12 - portfile update ryandesign@… update Normal ports

Reported by florian@…, 4 years ago.

Description

hi, i updated the portfile to build openconnect 3.12. since the distfile for this version does not seem to exist on http mirrors i removed them. the dependency port:gconf is not required to build the port. cheers

#32304 openconnect new version 3.15 - portfile update ryandesign@… update Normal ports

Reported by florian@…, 3 years ago.

Description

openconnect 3.15 resolves several NLS related bugs. I added a new variant +nls and removed the build dependency port:intltool.

#41538 Openconnect portfile upgrade from 4.08 to 5.01 macports-tickets@… update Normal ports

Reported by xcompass@…, 16 months ago.

Description

Openconnect portfile upgrade from 4.08 to 5.01

#45375 openconnect: +ssl variant builds against gnutls anyway macports-tickets@… defect Normal ports

Reported by mschamschula@…, 6 months ago.

Description

openconnect +ssl variant builds against gnutls anyway.

Fixed configure.args. Be explicit as to what to enable and what to disable.

#46267 openconnect update to 7.01 patch ryandesign@… update Normal ports

Reported by mikepparson@…, 3 months ago.

Description

Not much here, mostly updated checksums for the new file.

#32995 opencore-amr 0.1.2 (new port) ryandesign@… submission Normal ports

Reported by hans@…, 3 years ago.

Description

This is a port of http://sourceforge.net/projects/opencore-amr/

  • an implementation of the AMR speech codec.
#33487 opencore-amr @0.1.3 update dports@… update Normal ports

Reported by hans@…, 3 years ago.

Description

Recently, a new version of opencore-amr was relased. Attached is a diff to the Portfile that brings the port up to this version. Tested on 10.5.8.

#22219 opencore-amr port macports-tickets@… submission Normal ports

Reported by lee@…, 5 years ago.

Description

I made a port for opencore-amr, a Library of OpenCORE Framework implementation of Adaptive Multi Rate Narrowband and Wideband speech codec. Built on OS version 10.6.1.

#21014 OpenCV 1.0.0 does not build on snow leopard ryandesign@… defect Normal ports

Reported by grundmann.matthias@…, 6 years ago.

Description

Currently, OpenCV does not compile on SnowLeopard for architecture x86_64.

First it returns errors for dummy.cpp of the form: dummy.cpp:1: error: CPU you selected does not support x86-64 instruction set

These errors are caused by the -march=prescott setting. I can get around those errors by adding

-march=nocona -mtune=generic

to the configure.cxxflags-append section of the Portfile.

However, I get a lot of errors in the

window_carbon.cpp file, like

Command output: window_carbon.cpp:296: error: 'SetWindowBounds' was not declared in this scope

:296: error: 'SetWindowBounds' was not declared in this scope

I think this problem will be much harder to solve, when I understand it correctly there is no 64bit carbon, only 64 bit cocoa.

Any input would be appreciated.

#23806 opencv @2.0.0 build failure stante@… defect Normal ports

Reported by matteo.soccorsi@…, 5 years ago.

Description

PPC G4 Mac OS 10.4.11 Xcode 2.5

libtool: compile:  /usr/bin/gcc-4.0 -DHAVE_CONFIG_H -I. -I.. -I../3rdparty/include -DNDEBUG -I../3rdparty/flann -I../3rdparty/flann/algorithms -I../3rdparty/flann/nn -I../3rdparty/flann/util -I/opt/local/include -O3 -falign-loops-max-skip=15 -falign-jumps-max-skip=15 -falign-loops=16 -falign-jumps=16 -falign-functions=16 -ffast-math -fstrict-aliasing -funroll-loops -ftree-loop-linear -ftree-loop-memset -mcpu=G4 -mpowerpc-gpopt -mtune=G5 -fsched-interblock -fgcse-sm -g -O2 -arch ppc -O2 -arch ppc -MT dlasq2.lo -MD -MP -MF .deps/dlasq2.Tpo -c lapack/dlasq2.c  -fno-common -DPIC -o .libs/dlasq2.o
lapack/dlasq2.c: In function 'dlasq2_':
lapack/dlasq2.c:13: internal compiler error: in memset_analyze_data_refs, at tree-ssa-loop-memset.c:138
Please submit a full bug report,
with preprocessed source if appropriate.
See <URL:http://developer.apple.com/bugreporter> for instructions.
make[2]: *** [dlasq2.lo] Error 1
make[1]: *** [all-recursive] Error 1
make: *** [all] Error 2
Error: Target org.macports.build returned: shell command " cd "/opt/local/var/macports/build/_opt_local_var_macports_sources_rsync.macports.org_release_ports_graphics_opencv/work/OpenCV-2.0.0" && /usr/bin/make -j1 all " returned error 2
DEBUG: Backtrace: shell command " cd "/opt/local/var/macports/build/_opt_local_var_macports_sources_rsync.macports.org_release_ports_graphics_opencv/work/OpenCV-2.0.0" && /usr/bin/make -j1 all " returned error 2
    while executing
"command_exec build"
    (procedure "portbuild::build_main" line 9)
    invoked from within
"$procedure $targetname"
Warning: the following items did not execute (for opencv): org.macports.destroot org.macports.build
DEBUG: Registry error: unzip not registered as installed & active.
    while executing
"registry::active $portname"
Error: Unable to upgrade port: 1

#24896 opencv-2.0.0 Can't read "build.cmd" macports-tickets@… defect Normal ports

Reported by matthew.barulic@…, 5 years ago.

Description

While attempting to install 'opencv' on Mac OS X v10.6.3, using

sudo port install opencv

the following error was returned

--->  Computing dependencies for opencvError: Unable to execute port: can't read "build.cmd": Failed to locate 'make' in path: '/opt/local/bin:/opt/local/sbin:/bin:/sbin:/usr/bin:/usr/sbin' or at its MacPorts configuration time location, did you move it?
#24594 OpenCV 2.0 - HoughLinesP memory allocation stante@… defect Normal ports

Reported by nicola.conci@…, 5 years ago.

Description

hi, I tried running the HoughLinesP function on a video, to check consistency of lines over successive frames. I guess there is something wrong with the allocation/deallocation though, since running it several times you notice the memory increases until the computer slows down.

if I comment the HoughLinesP function, everything runs smoothly.

That's a sample of the code (myFrame and edges are 320x240):

int	blockSize=8;

for (int c=1;c<300;c++) {
	 	
		cap >> myFrame;

		cvtColor(myFrame, edges, CV_RGB2GRAY, 0);
		
		Canny(edges, edges, 80, 120, 3, false);

		for (int k=0;k<(edges.rows-blockSize);k+=blockSize-1) {
			for (int l=0;l<(edges.cols-blockSize);l+=blockSize-1) {				
				vector<Vec4i> lines;
				Mat blockEdge(edges,Rect(l,k,blockSize,blockSize));
				Mat blockOrig(myFrame,Rect(l,k,blockSize,blockSize));				
				//APPLY HOUGH
				HoughLinesP(blockEdge, lines, 1, CV_PI/90, 5, 4, 10 );
				
				blockEdge.release();
				blockOrig.release();

			
			}
		}
		
		waitKey(10);
		printf("Frame n: %d", c);
		
	}

Thanks, Nicola

#26642 opencv 2.1.0 memory leaks stante@… defect Normal ports

Reported by gonzalo.llorente@…, 5 years ago.

Description

Hi,

I think there must be something wrong with function cvShowImage(). A simple piece of code that plays a video like (see below) just keeps allocating memory all the time. This same program compiled against port opencv 2.0.0 just takes 30 MB and stays around that amount of memory.

code:

#include <stdio.h> #include "highgui.h"

int main(int argc, char* argv[]) {

if (argc != 2) {

printf("%s <file>\n", argv[0]); return -1;

}

char *title = argv[1];

cvNamedWindow(title, CV_WINDOW_AUTOSIZE); CvCapture *capture = cvCreateFileCapture(argv[1]); IplImage *frame;

while (1) {

frame = cvQueryFrame(capture); if (!frame)

break;

cvShowImage() posible memory leak... cvShowImage(title, frame); char c = cvWaitKey(33); if (c == 27)

break;

}

cvReleaseCapture(&capture); cvDestroyWindow(title); return 0;

}

If I comment out the line that show the image on screen (cvShowImage()) the behaviour of the memory is right. So I think that maybe something is wrong with this function...

I don't know if this should be reported to the opencv developers... Thanks for the help.

#36840 OpenCV @2.3.1_a3 Revision 90303 port install fails macports-tickets@… defect Normal ports

Reported by hbarkley@…, 2 years ago.

Description

The port file for OpenCV revision 90303 fails to install due to the dependency port ffmpeg version 1.0 being dynamically updated. Version 0.7.13 of ffmpeg is required to build OpenCV 2.3.1. I've manually installed the 0.7.13 revision of ffmpeg and deactivated the 1.0 revision. When I run the OpenCV portfile, it dynamically updates it to revision 1.0. Please advise.

#31868 opencv @2.3.1a Configure failure: shell command failed macports-tickets@… defect Normal ports

Reported by andrew.c.stewart@…, 3 years ago.

Description

Received the following error while trying to upgrade opencv to 2.3.1a ( #31818 ). Uninstalled and reinstalled opencv and received the same error.

kg-ast:build astewart$ sudo port install opencv
Password:
--->  Computing dependencies for opencv
--->  Configuring opencv
Error: Target org.macports.configure returned: configure failure: shell command failed (see log for details)
Log for opencv is at: /opt/local/var/macports/logs/_opt_local_var_macports_sources_rsync.macports.org_release_ports_graphics_opencv/opencv/main.log
Error: Status 1 encountered during processing.
To report a bug, see <http://guide.macports.org/#project.tickets>

#32493 OpenCV 2.3.1 build fails macports-tickets@… defect Normal ports

Reported by orgicus@…, 3 years ago.

Description

Hello,

I am trying to install OpenCV via macports and have ran into errors. macports downloaded and installed all dependencies, but failed to build opencv:

--->  Building opencv
Error: Target org.macports.build returned: shell command failed (see log for details)
Log for opencv is at: /opt/local/var/macports/logs/_opt_local_var_macports_sources_rsync.macports.org_release_tarballs_ports_graphics_opencv/opencv/main.log
Error: Status 1 encountered during processing.
To report a bug, see <http://guide.macports.org/#project.tickets>

I've tried cleaning the port and installing again, but had the same issue. main.log attached.

I am using osx 10.6.8 (upgraded from 10.5, re-installed Xcode and MacPorts-1.9.2-10.6-SnowLeopard )

Unfortunately I'm can't understand most of the log, so don't know what I'm doing wrong. Any hints/tips will help

#34451 opencv: 2.4.0 +universal fails raphael@… defect Normal ports
#34753 OpenCV 2.4.1 raphael@… update Normal ports

Reported by reitmayr@…, 3 years ago.

Description

Hi,

I updated the opencv portfile to download and compile OpenCV 2.4.1. This update works with CUDA on OSX 10.7.3 while OpenCV 2.4.0 did not.

The diff to the portfile is attached, it is just an update to the new distribution files and the version.

best regards,

Gerhard

#37074 opencv @2.4.3_1 does not add apple-gcc42 dependency when needed stromnov@… defect Normal ports

Reported by david@…, 2 years ago.

Description

opencv @2.4.3, Revision 1 fails to install. From the log:

:info:configure CMake Error at /opt/local/share/cmake-2.8/Modules/CMakeDetermineCXXCompiler.cmake:43 (MESSAGE):
:info:configure   Could not find compiler set in environment variable CXX:
:info:configure 
:info:configure   /opt/local/bin/g++-apple-4.2.

Installing the apple-gcc42 port fixes the problem.

I looked at the opencv Portfile and it doesn't specify apple-gcc42 explicitly, it only blacklists gcc-4.0 and llvm-gcc-4.2 and clang.

I don't know if it is possible to specify "any 1 of x or y or z compiler ports" as a dependency, and give a nicer error message if that dependency isn't met? We probably don't want to explicitly set apple-gcc42 as a build requirement, because the user might have another valid compiler available.

#38194 opencv @2.4.3_4: uses jasper's headers but does not depend on it stromnov@… defect Normal ports

Reported by mstath@…, 2 years ago.

Description

OS X 10.8.2 Mountain Lion. Xcode Version 4.6 (4H127) w/ command line tools installed.

Command execution failed; no broken files found. Excerpt from log file (attached):

OpenCV-2.4.3" && /usr/bin/make -j2 -w all 
:info:build Exit code: 2
:error:build org.macports.build for port opencv returned: command execution failed
:debug:build Error code: CHILDSTATUS 79211 2
#37530 OpenCV 2.4.3 fails to build on fresh install of Mountain Lion macports-tickets@… defect Normal ports

Reported by macports@…, 2 years ago.

Description

I'm on a freshly installed Mountain Lion with all current updates installed (Mac OS X 10.8.2), including a current XCode with Unix commandline tools (i.e. clang, etc) installed. I've installed MacPorts from the *.mpkg binary installer, issued "sudo port selfupdate" and installed just three packages (automake, autoconf, libtool) and then tried to install opencv including the Python 2.7 wrappers.

"sudo port install opencv +python27" fetched all dependencies, downloaded and extracted the OpenCV tarball, but failed configuring it. The error is (see attached logfile) stated below. Cleaning and trying again did result in an identical error.

:info:configure -- The CXX compiler identification is GNU 4.2.1
:info:configure -- The C compiler identification is GNU 4.2.1
:info:configure CMake Error at /opt/local/share/cmake-2.8/Modules/Platform/Darwin.cmake:190 (message):
:info:configure   CMAKE_OSX_DEPLOYMENT_TARGET is '10.8' but CMAKE_OSX_SYSROOT:
:info:configure 
:info:configure    "/"
:info:configure 
:info:configure   is not set to a MacOSX SDK with a recognized version.  Either set
:info:configure   CMAKE_OSX_SYSROOT to a valid SDK or set CMAKE_OSX_DEPLOYMENT_TARGET to
:info:configure   empty.
:info:configure Call Stack (most recent call first):
:info:configure   /opt/local/share/cmake-2.8/Modules/CMakeSystemSpecificInformation.cmake:36 (include)
:info:configure   CMakeLists.txt:61 (project)
:info:configure 
:info:configure 
:info:configure -- Configuring incomplete, errors occurred!
:info:configure Command failed:  cd "/opt/local/var/macports/build/_opt_local_var_macports_sources_rsync.macports.org_release_tarballs_ports_graphics_opencv/opencv/work/OpenCV-2.4.3" && cmake -DCMAKE_INSTALL_PREFIX=/opt/local -DCMAKE_VERBOSE_MAKEFILE=ON -DCMAKE_COLOR_MAKEFILE=ON -DCMAKE_BUILD_TYPE=Release -DCMAKE_BUILD_WITH_INSTALL_RPATH=ON -DCMAKE_INSTALL_NAME_DIR=/opt/local/lib -DCMAKE_SYSTEM_PREFIX_PATH="/opt/local;/usr" -DCMAKE_MODULE_PATH=/opt/local/share/cmake/modules -Wno-dev -DWITH_1394=OFF -DWITH_CARBON=OFF -DWITH_CUBLAS=OFF -DWITH_CUDA=OFF -DWITH_CUFFT=OFF -DWITH_EIGEN=OFF -DWITH_FFMPEG=ON -DWITH_GSTREAMER=OFF -DWITH_GTK=OFF -DWITH_IMAGEIO=OFF -DWITH_IPP=OFF -DWITH_JASPER=ON -DWITH_JPEG=ON -DWITH_OPENEXR=ON -DWITH_OPENGL=ON -DWITH_OPENNI=OFF -DWITH_PNG=ON -DWITH_PVAPI=OFF -DWITH_GIGEAPI=OFF -DWITH_QT=OFF -DWITH_QUICKTIME=OFF -DWITH_TBB=OFF -DWITH_CSTRIPES=OFF -DWITH_TIFF=ON -DWITH_UNICAP=OFF -DWITH_V4L=OFF -DWITH_VIDEOINPUT=OFF -DWITH_XIMEA=OFF -DWITH_XINE=OFF -DWITH_OPENCL=OFF -DWITH_OPENCLAMDFFT=OFF -DWITH_OPENCLAMDBLAS=OFF -DBUILD_SHARED_LIBS=ON -DBUILD_DOCS=OFF -DBUILD_EXAMPLES=OFF -DBUILD_PERF_TESTS=OFF -DBUILD_TESTS=OFF -DBUILD_ZLIB=OFF -DBUILD_TIFF=OFF -DBUILD_JASPER=OFF -DBUILD_JPEG=OFF -DBUILD_PNG=OFF -DBUILD_OPENEXR=OFF -DINSTALL_C_EXAMPLES=OFF -DENABLE_PRECOMPILED_HEADERS=ON -DCMAKE_VERBOSE=ON -DZLIB_LIBRARY=/opt/local/lib/libz.dylib -DBZIP2_LIBRARIES=/opt/local/lib/libbz2.dylib -DINSTALL_PYTHON_EXAMPLES=ON -DPYTHON_EXECUTABLE=/opt/local/bin/python2.7 -DPYTHON_LIBRARY=/opt/local/lib/libpython2.7.dylib -DPYTHON_INCLUDE_DIR=/opt/local/Library/Frameworks/Python.framework/Versions/2.7/Headers -DPYTHON_PACKAGES_PATH=/opt/local/Library/Frameworks/Python.framework/Versions/2.7/lib/python2.7/site-packages -DCMAKE_OSX_ARCHITECTURES="x86_64" -DCMAKE_OSX_SYSROOT=/ -DOPENCV_LINKER_LIBS="-Wl,-headerpad_max_install_names" 
:info:configure Exit code: 1

A short web search resulted in the info that this might be due to a broken cmake. This is what I found:
MacPorts cmake ticket #37527
http://public.kitware.com/Bug/print_bug_page.php?bug_id=9959
http://cmake.3232098.n2.nabble.com/OSX-deployment-target-confusion-for-2-8-10-td7582284.html

#37339 opencv @2.4.3 +opencl fails to build on Snow Leopard stromnov@… defect Normal ports

Reported by egall@…, 2 years ago.

Description

Of the variants, the opencl one seems to be the one at fault; removing it caused it to compile correctly. My currently installed OpenCV is:

sh-3.2# port -d installed opencv
The following ports are currently installed:
  opencv @2.4.3_1+debug+eigen+openni+python27+universal (active) platform='darwin 10' archs='i386 x86_64'

Relevant parts of the attached log:

:info:build [ 44%] Building CXX object modules/ocl/CMakeFiles/opencv_ocl.dir/src/error.cpp.o
:info:build cd /opt/local/var/macports/build/_opt_local_var_macports_sources_rsync.macports.org_release_tarballs_ports_graphics_opencv/opencv/work/OpenCV-2.4.3/modules/ocl && /usr/bin/g++-4.2   -Dopencv_ocl_EXPORTS -DHAVE_CVCONFIG_H -DHAVE_ALLOCA -DHAVE_ALLOCA_H -DHAVE_LIBPTHREAD -DHAVE_UNISTD_H -DCVAPI_EXPORTS -pipe -O2 -arch x86_64 -arch i386    -W -Wall -Werror=return-type -Werror=address -Werror=sequence-point -Wformat -Werror=format-security -Wmissing-prototypes -Wundef -Winit-self -Wpointer-arith -Wshadow -Wsign-promo -fdiagnostics-show-option -pthread -fomit-frame-pointer -msse -msse2 -msse3 -arch x86_64 -arch i386 -isysroot / -mmacosx-version-min=10.6 -fPIC -I/opt/local/var/macports/build/_opt_local_var_macports_sources_rsync.macports.org_release_tarballs_ports_graphics_opencv/opencv/work/OpenCV-2.4.3/modules/video/include -I/opt/local/var/macports/build/_opt_local_var_macports_sources_rsync.macports.org_release_tarballs_ports_graphics_opencv/opencv/work/OpenCV-2.4.3/modules/objdetect/include -I/opt/local/var/macports/build/_opt_local_var_macports_sources_rsync.macports.org_release_tarballs_ports_graphics_opencv/opencv/work/OpenCV-2.4.3/modules/features2d/include -I/opt/local/var/macports/build/_opt_local_var_macports_sources_rsync.macports.org_release_tarballs_ports_graphics_opencv/opencv/work/OpenCV-2.4.3/modules/highgui/include -I/opt/local/var/macports/build/_opt_local_var_macports_sources_rsync.macports.org_release_tarballs_ports_graphics_opencv/opencv/work/OpenCV-2.4.3/modules/flann/include -I/opt/local/var/macports/build/_opt_local_var_macports_sources_rsync.macports.org_release_tarballs_ports_graphics_opencv/opencv/work/OpenCV-2.4.3/modules/imgproc/include -I/opt/local/var/macports/build/_opt_local_var_macports_sources_rsync.macports.org_release_tarballs_ports_graphics_opencv/opencv/work/OpenCV-2.4.3/modules/core/include -I/opt/local/var/macports/build/_opt_local_var_macports_sources_rsync.macports.org_release_tarballs_ports_graphics_opencv/opencv/work/OpenCV-2.4.3/modules/ocl -I/opt/local/var/macports/build/_opt_local_var_macports_sources_rsync.macports.org_release_tarballs_ports_graphics_opencv/opencv/work/OpenCV-2.4.3/modules/ocl/src -I/opt/local/var/macports/build/_opt_local_var_macports_sources_rsync.macports.org_release_tarballs_ports_graphics_opencv/opencv/work/OpenCV-2.4.3/modules/ocl/include -I/opt/local/var/macports/build/_opt_local_var_macports_sources_rsync.macports.org_release_tarballs_ports_graphics_opencv/opencv/work/OpenCV-2.4.3 -I/opt/local/include -I/opt/local/include/eigen3    -o CMakeFiles/opencv_ocl.dir/src/error.cpp.o -c /opt/local/var/macports/build/_opt_local_var_macports_sources_rsync.macports.org_release_tarballs_ports_graphics_opencv/opencv/work/OpenCV-2.4.3/modules/ocl/src/error.cpp
:info:build In file included from /opt/local/var/macports/build/_opt_local_var_macports_sources_rsync.macports.org_release_tarballs_ports_graphics_opencv/opencv/work/OpenCV-2.4.3/modules/ocl/src/error.cpp:44:
:info:build /opt/local/var/macports/build/_opt_local_var_macports_sources_rsync.macports.org_release_tarballs_ports_graphics_opencv/opencv/work/OpenCV-2.4.3/modules/ocl/src/precomp.hpp:49:5: warning: "_MSC_VER" is not defined
:info:build In file included from /opt/local/var/macports/build/_opt_local_var_macports_sources_rsync.macports.org_release_tarballs_ports_graphics_opencv/opencv/work/OpenCV-2.4.3/modules/ocl/src/precomp.hpp:70,
:info:build                  from /opt/local/var/macports/build/_opt_local_var_macports_sources_rsync.macports.org_release_tarballs_ports_graphics_opencv/opencv/work/OpenCV-2.4.3/modules/ocl/src/error.cpp:44:
:info:build /opt/local/var/macports/build/_opt_local_var_macports_sources_rsync.macports.org_release_tarballs_ports_graphics_opencv/opencv/work/OpenCV-2.4.3/modules/ocl/include/opencv2/ocl/ocl.hpp:1741:5: warning: "_MSC_VER" is not defined
:info:build /opt/local/var/macports/build/_opt_local_var_macports_sources_rsync.macports.org_release_tarballs_ports_graphics_opencv/opencv/work/OpenCV-2.4.3/modules/ocl/include/opencv2/ocl/ocl.hpp:1746:5: warning: "_MSC_VER" is not defined
:info:build In file included from /opt/local/var/macports/build/_opt_local_var_macports_sources_rsync.macports.org_release_tarballs_ports_graphics_opencv/opencv/work/OpenCV-2.4.3/modules/ocl/include/opencv2/ocl/ocl.hpp:1745,
:info:build                  from /opt/local/var/macports/build/_opt_local_var_macports_sources_rsync.macports.org_release_tarballs_ports_graphics_opencv/opencv/work/OpenCV-2.4.3/modules/ocl/src/precomp.hpp:70,
:info:build                  from /opt/local/var/macports/build/_opt_local_var_macports_sources_rsync.macports.org_release_tarballs_ports_graphics_opencv/opencv/work/OpenCV-2.4.3/modules/ocl/src/error.cpp:44:
:info:build /opt/local/var/macports/build/_opt_local_var_macports_sources_rsync.macports.org_release_tarballs_ports_graphics_opencv/opencv/work/OpenCV-2.4.3/modules/ocl/include/opencv2/ocl/matrix_operations.hpp: In constructor ‘cv::ocl::oclMat::oclMat(const cv::ocl::oclMat&, const cv::Range&, const cv::Range&)’:
:info:build /opt/local/var/macports/build/_opt_local_var_macports_sources_rsync.macports.org_release_tarballs_ports_graphics_opencv/opencv/work/OpenCV-2.4.3/modules/ocl/include/opencv2/ocl/matrix_operations.hpp:144: warning: declaration of ‘colRange’ shadows a member of 'this' [-Wshadow]
:info:build /opt/local/var/macports/build/_opt_local_var_macports_sources_rsync.macports.org_release_tarballs_ports_graphics_opencv/opencv/work/OpenCV-2.4.3/modules/ocl/include/opencv2/ocl/matrix_operations.hpp:144: warning: declaration of ‘rowRange’ shadows a member of 'this' [-Wshadow]
:info:build /opt/local/var/macports/build/_opt_local_var_macports_sources_rsync.macports.org_release_tarballs_ports_graphics_opencv/opencv/work/OpenCV-2.4.3/modules/ocl/include/opencv2/ocl/matrix_operations.hpp: In member function ‘void cv::ocl::oclMat::assignTo(cv::ocl::oclMat&, int) const’:
:info:build /opt/local/var/macports/build/_opt_local_var_macports_sources_rsync.macports.org_release_tarballs_ports_graphics_opencv/opencv/work/OpenCV-2.4.3/modules/ocl/include/opencv2/ocl/matrix_operations.hpp:299: warning: declaration of ‘type’ shadows a member of 'this' [-Wshadow]
:info:build /opt/local/var/macports/build/_opt_local_var_macports_sources_rsync.macports.org_release_tarballs_ports_graphics_opencv/opencv/work/OpenCV-2.4.3/modules/ocl/include/opencv2/ocl/matrix_operations.hpp: In member function ‘cv::ocl::oclMat cv::ocl::oclMat::operator()(cv::Range, cv::Range) const’:
:info:build /opt/local/var/macports/build/_opt_local_var_macports_sources_rsync.macports.org_release_tarballs_ports_graphics_opencv/opencv/work/OpenCV-2.4.3/modules/ocl/include/opencv2/ocl/matrix_operations.hpp:373: warning: declaration of ‘colRange’ shadows a member of 'this' [-Wshadow]
:info:build /opt/local/var/macports/build/_opt_local_var_macports_sources_rsync.macports.org_release_tarballs_ports_graphics_opencv/opencv/work/OpenCV-2.4.3/modules/ocl/include/opencv2/ocl/matrix_operations.hpp:373: warning: declaration of ‘rowRange’ shadows a member of 'this' [-Wshadow]
:info:build /opt/local/var/macports/build/_opt_local_var_macports_sources_rsync.macports.org_release_tarballs_ports_graphics_opencv/opencv/work/OpenCV-2.4.3/modules/ocl/src/error.cpp: In function ‘const char* cv::ocl::getOpenCLErrorString(int)’:
:info:build /opt/local/var/macports/build/_opt_local_var_macports_sources_rsync.macports.org_release_tarballs_ports_graphics_opencv/opencv/work/OpenCV-2.4.3/modules/ocl/src/error.cpp:88: error: ‘CL_MISALIGNED_SUB_BUFFER_OFFSET’ was not declared in this scope
:info:build /opt/local/var/macports/build/_opt_local_var_macports_sources_rsync.macports.org_release_tarballs_ports_graphics_opencv/opencv/work/OpenCV-2.4.3/modules/ocl/src/error.cpp:90: error: ‘CL_EXEC_STATUS_ERROR_FOR_EVENTS_IN_WAIT_LIST’ was not declared in this scope
:info:build In file included from /opt/local/var/macports/build/_opt_local_var_macports_sources_rsync.macports.org_release_tarballs_ports_graphics_opencv/opencv/work/OpenCV-2.4.3/modules/ocl/src/error.cpp:44:
:info:build /opt/local/var/macports/build/_opt_local_var_macports_sources_rsync.macports.org_release_tarballs_ports_graphics_opencv/opencv/work/OpenCV-2.4.3/modules/ocl/src/precomp.hpp:49:5: warning: "_MSC_VER" is not defined
:info:build In file included from /opt/local/var/macports/build/_opt_local_var_macports_sources_rsync.macports.org_release_tarballs_ports_graphics_opencv/opencv/work/OpenCV-2.4.3/modules/ocl/src/precomp.hpp:70,
:info:build                  from /opt/local/var/macports/build/_opt_local_var_macports_sources_rsync.macports.org_release_tarballs_ports_graphics_opencv/opencv/work/OpenCV-2.4.3/modules/ocl/src/error.cpp:44:
:info:build /opt/local/var/macports/build/_opt_local_var_macports_sources_rsync.macports.org_release_tarballs_ports_graphics_opencv/opencv/work/OpenCV-2.4.3/modules/ocl/include/opencv2/ocl/ocl.hpp:1741:5: warning: "_MSC_VER" is not defined
:info:build /opt/local/var/macports/build/_opt_local_var_macports_sources_rsync.macports.org_release_tarballs_ports_graphics_opencv/opencv/work/OpenCV-2.4.3/modules/ocl/include/opencv2/ocl/ocl.hpp:1746:5: warning: "_MSC_VER" is not defined
:info:build In file included from /opt/local/var/macports/build/_opt_local_var_macports_sources_rsync.macports.org_release_tarballs_ports_graphics_opencv/opencv/work/OpenCV-2.4.3/modules/ocl/include/opencv2/ocl/ocl.hpp:1745,
:info:build                  from /opt/local/var/macports/build/_opt_local_var_macports_sources_rsync.macports.org_release_tarballs_ports_graphics_opencv/opencv/work/OpenCV-2.4.3/modules/ocl/src/precomp.hpp:70,
:info:build                  from /opt/local/var/macports/build/_opt_local_var_macports_sources_rsync.macports.org_release_tarballs_ports_graphics_opencv/opencv/work/OpenCV-2.4.3/modules/ocl/src/error.cpp:44:
:info:build /opt/local/var/macports/build/_opt_local_var_macports_sources_rsync.macports.org_release_tarballs_ports_graphics_opencv/opencv/work/OpenCV-2.4.3/modules/ocl/include/opencv2/ocl/matrix_operations.hpp: In constructor ‘cv::ocl::oclMat::oclMat(const cv::ocl::oclMat&, const cv::Range&, const cv::Range&)’:
:info:build /opt/local/var/macports/build/_opt_local_var_macports_sources_rsync.macports.org_release_tarballs_ports_graphics_opencv/opencv/work/OpenCV-2.4.3/modules/ocl/include/opencv2/ocl/matrix_operations.hpp:144: warning: declaration of ‘colRange’ shadows a member of 'this' [-Wshadow]
:info:build /opt/local/var/macports/build/_opt_local_var_macports_sources_rsync.macports.org_release_tarballs_ports_graphics_opencv/opencv/work/OpenCV-2.4.3/modules/ocl/include/opencv2/ocl/matrix_operations.hpp:144: warning: declaration of ‘rowRange’ shadows a member of 'this' [-Wshadow]
:info:build /opt/local/var/macports/build/_opt_local_var_macports_sources_rsync.macports.org_release_tarballs_ports_graphics_opencv/opencv/work/OpenCV-2.4.3/modules/ocl/include/opencv2/ocl/matrix_operations.hpp: In member function ‘void cv::ocl::oclMat::assignTo(cv::ocl::oclMat&, int) const’:
:info:build /opt/local/var/macports/build/_opt_local_var_macports_sources_rsync.macports.org_release_tarballs_ports_graphics_opencv/opencv/work/OpenCV-2.4.3/modules/ocl/include/opencv2/ocl/matrix_operations.hpp:299: warning: declaration of ‘type’ shadows a member of 'this' [-Wshadow]
:info:build /opt/local/var/macports/build/_opt_local_var_macports_sources_rsync.macports.org_release_tarballs_ports_graphics_opencv/opencv/work/OpenCV-2.4.3/modules/ocl/include/opencv2/ocl/matrix_operations.hpp: In member function ‘cv::ocl::oclMat cv::ocl::oclMat::operator()(cv::Range, cv::Range) const’:
:info:build /opt/local/var/macports/build/_opt_local_var_macports_sources_rsync.macports.org_release_tarballs_ports_graphics_opencv/opencv/work/OpenCV-2.4.3/modules/ocl/include/opencv2/ocl/matrix_operations.hpp:373: warning: declaration of ‘colRange’ shadows a member of 'this' [-Wshadow]
:info:build /opt/local/var/macports/build/_opt_local_var_macports_sources_rsync.macports.org_release_tarballs_ports_graphics_opencv/opencv/work/OpenCV-2.4.3/modules/ocl/include/opencv2/ocl/matrix_operations.hpp:373: warning: declaration of ‘rowRange’ shadows a member of 'this' [-Wshadow]
:info:build /opt/local/var/macports/build/_opt_local_var_macports_sources_rsync.macports.org_release_tarballs_ports_graphics_opencv/opencv/work/OpenCV-2.4.3/modules/ocl/src/error.cpp: In function ‘const char* cv::ocl::getOpenCLErrorString(int)’:
:info:build /opt/local/var/macports/build/_opt_local_var_macports_sources_rsync.macports.org_release_tarballs_ports_graphics_opencv/opencv/work/OpenCV-2.4.3/modules/ocl/src/error.cpp:88: error: ‘CL_MISALIGNED_SUB_BUFFER_OFFSET’ was not declared in this scope
:info:build /opt/local/var/macports/build/_opt_local_var_macports_sources_rsync.macports.org_release_tarballs_ports_graphics_opencv/opencv/work/OpenCV-2.4.3/modules/ocl/src/error.cpp:90: error: ‘CL_EXEC_STATUS_ERROR_FOR_EVENTS_IN_WAIT_LIST’ was not declared in this scope
:info:build lipo: can't open input file: /var/tmp//cccMUIZz.out (No such file or directory)
:info:build make[2]: *** [modules/ocl/CMakeFiles/opencv_ocl.dir/src/error.cpp.o] Error 1
:info:build make[2]: Leaving directory `/opt/local/var/macports/build.build/_opt_local_var_macports_sources_rsync.macports.org_release_tarballs_ports_graphics_opencv/opencv/work/OpenCV-2.4.3'
:info:build make[1]: *** [modules/ocl/CMakeFiles/opencv_ocl.dir/all] Error 2
:info:build make[1]: *** Waiting for unfinished jobs....
:info:build Linking CXX shared library ../../lib/libopencv_calib3d.dylib
:info:build cd /opt/local/var/macports/build/_opt_local_var_macports_sources_rsync.macports.org_release_tarballs_ports_graphics_opencv/opencv/work/OpenCV-2.4.3/modules/calib3d && /opt/local/bin/cmake -E cmake_link_script CMakeFiles/opencv_calib3d.dir/link.txt --verbose=1
:info:build /usr/bin/g++-4.2  -pipe -O2 -arch x86_64 -arch i386    -W -Wall -Werror=return-type -Werror=address -Werror=sequence-point -Wformat -Werror=format-security -Wmissing-prototypes -Wundef -Winit-self -Wpointer-arith -Wshadow -Wsign-promo -fdiagnostics-show-option -pthread -fomit-frame-pointer -msse -msse2 -msse3 -arch x86_64 -arch i386 -isysroot / -mmacosx-version-min=10.6 -dynamiclib -Wl,-headerpad_max_install_names  -L/opt/local/lib -arch x86_64 -arch i386 -compatibility_version 2.4.0 -current_version 2.4.3 -o ../../lib/libopencv_calib3d.2.4.3.dylib -install_name /opt/local/lib/libopencv_calib3d.2.4.dylib CMakeFiles/opencv_calib3d.dir/src/calibinit.cpp.o CMakeFiles/opencv_calib3d.dir/src/calibration.cpp.o CMakeFiles/opencv_calib3d.dir/src/checkchessboard.cpp.o CMakeFiles/opencv_calib3d.dir/src/circlesgrid.cpp.o CMakeFiles/opencv_calib3d.dir/src/epnp.cpp.o CMakeFiles/opencv_calib3d.dir/src/fundam.cpp.o CMakeFiles/opencv_calib3d.dir/src/modelest.cpp.o CMakeFiles/opencv_calib3d.dir/src/p3p.cpp.o CMakeFiles/opencv_calib3d.dir/src/polynom_solver.cpp.o CMakeFiles/opencv_calib3d.dir/src/posit.cpp.o CMakeFiles/opencv_calib3d.dir/src/precomp.cpp.o CMakeFiles/opencv_calib3d.dir/src/quadsubpix.cpp.o CMakeFiles/opencv_calib3d.dir/src/solvepnp.cpp.o CMakeFiles/opencv_calib3d.dir/src/stereobm.cpp.o CMakeFiles/opencv_calib3d.dir/src/stereosgbm.cpp.o CMakeFiles/opencv_calib3d.dir/src/triangulate.cpp.o ../../lib/libopencv_core.2.4.3.dylib ../../lib/libopencv_imgproc.2.4.3.dylib ../../lib/libopencv_flann.2.4.3.dylib ../../lib/libopencv_highgui.2.4.3.dylib ../../lib/libopencv_features2d.2.4.3.dylib -Wl,-headerpad_max_install_names ../../lib/libopencv_flann.2.4.3.dylib ../../lib/libopencv_highgui.2.4.3.dylib ../../lib/libopencv_imgproc.2.4.3.dylib ../../lib/libopencv_core.2.4.3.dylib /usr/lib/libz.dylib -Wl,-headerpad_max_install_names 
:info:build cd /opt/local/var/macports/build/_opt_local_var_macports_sources_rsync.macports.org_release_tarballs_ports_graphics_opencv/opencv/work/OpenCV-2.4.3/modules/calib3d && /opt/local/bin/cmake -E cmake_symlink_library ../../lib/libopencv_calib3d.2.4.3.dylib ../../lib/libopencv_calib3d.2.4.dylib ../../lib/libopencv_calib3d.dylib
:info:build make[2]: Leaving directory `/opt/local/var/macports/build.build/_opt_local_var_macports_sources_rsync.macports.org_release_tarballs_ports_graphics_opencv/opencv/work/OpenCV-2.4.3'
:info:build /opt/local/bin/cmake -E cmake_progress_report /opt/local/var/macports/build/_opt_local_var_macports_sources_rsync.macports.org_release_tarballs_ports_graphics_opencv/opencv/work/OpenCV-2.4.3/CMakeFiles  1 2 3
:info:build [ 44%] Built target opencv_calib3d
:info:build make[1]: Leaving directory `/opt/local/var/macports/build.build/_opt_local_var_macports_sources_rsync.macports.org_release_tarballs_ports_graphics_opencv/opencv/work/OpenCV-2.4.3'
:info:build make: *** [all] Error 2
:info:build make: Leaving directory `/opt/local/var/macports/build.build/_opt_local_var_macports_sources_rsync.macports.org_release_tarballs_ports_graphics_opencv/opencv/work/OpenCV-2.4.3'
:info:build Command failed:  cd "/opt/local/var/macports/build/_opt_local_var_macports_sources_rsync.macports.org_release_tarballs_ports_graphics_opencv/opencv/work/OpenCV-2.4.3" && /usr/bin/make -j2 -w all 
:info:build Exit code: 2
:error:build org.macports.build for port opencv returned: command execution failed
:debug:build Error code: CHILDSTATUS 54560 2
:debug:build Backtrace: command execution failed
    while executing
"system -nice 0 $fullcmdstring"
    ("eval" body line 1)
    invoked from within
"eval system $notty $nice \$fullcmdstring"
    invoked from within
"command_exec build"
    (procedure "portbuild::build_main" line 8)
    invoked from within
"$procedure $targetname"
:info:build Warning: targets not executed for opencv: org.macports.activate org.macports.build org.macports.destroot org.macports.install
#41587 opencv@2.4.7_1 cannot remove qt4 variant... macports-tickets@… defect Normal ports

Reported by dllau@…, 16 months ago.

Description

I'm trying to install opencv without the qt4 variant. I use the typical -qt4 flag, but listing the variants of the install packages show that qt4 is still there. Any one else see this?

#41299 opencv 2.4.7 missing cmake config file stromnov@… defect Normal ports

Reported by hartmut@…, 17 months ago.

Description

Not sure if this is an upstream failure.

Trying to configure a client application with it:

cmake -DOpenCV_DIR=/opt/local/lib/cmake ..
CMake Error at /opt/local/lib/cmake/OpenCVConfig.cmake:44 (include):
  include could not find load file:

    /opt/local/lib/cmake/OpenCVModules.cmake
Call Stack (most recent call first):
  CMakeLists.txt:13 (find_package)

...
#34157 opencv 2.4 beta macports-tickets@… update Normal ports

Reported by cquiter@…, 3 years ago.

Description

Lots of great functionality added. It'd be nice to have this version as an optional upgrade. http://code.opencv.org/projects/opencv/wiki/ChangeLog

#24075 opencv: allow ffmpeg-devel stante@… enhancement Normal ports

Reported by ryandesign@…, 5 years ago.

Description

Does opencv really require specifically the ffmpeg port or would ffmpeg-devel suffice? If the latter, please allow this by specifying the ffmpeg dependency using path:-style not port:-style. See other ports that depend on ffmpeg for an example.

#33224 opencv: build error because of rogue libpng, libtiff and libjasper frameworks macports-tickets@… defect Normal ports

Reported by vvaytodawn@…, 3 years ago.

Description
$  sudo port install opencv +universal
--->  Computing dependencies for opencv
--->  Building opencv
Error: Target org.macports.build returned: shell command failed (see log for details)
Log for opencv is at: /opt/local/var/macports/logs/_opt_local_var_macports_sources_rsync.macports.org_release_tarballs_ports_graphics_opencv/opencv/main.log
Error: Status 1 encountered during processing.
To report a bug, see <http://guide.macports.org/#project.tickets>
#24271 opencv build problem macports-tickets@… defect Normal ports

Reported by johnny.boldt@…, 5 years ago.

Description

osx 10.4.11 MacBook Pro

I installed opencv. I went to install it again because I think my version was outdated and this happened. Now my old one is corrupt and i can't use the new one. I spent all weekend trying to fix this via google. please help.

--->  Fetching opencv
--->  Attempting to fetch OpenCV-2.0.0.tar.bz2 from http://internap.dl.sourceforge.net/opencvlibrary
--->  Verifying checksum(s) for opencv
--->  Extracting opencv
--->  Configuring opencv
--->  Building opencv
Error: Target org.macports.build returned: shell command " cd "/opt/local/var/macports/build/_opt_local_var_macports_sources_rsync.macports.org_release_ports_graphics_opencv/work/OpenCV-2.0.0" && /usr/bin/make -j1 all " returned error 2
Command output: highgui/cvcap_qt.cpp:518: warning: 'GetPixRowBytes' is deprecated (declared at /System/Library/Frameworks/ApplicationServices.framework/Frameworks/QD.framework/Headers/QDOffscreen.h:376)
highgui/cvcap_qt.cpp:524: warning: 'UnlockPixels' is deprecated (declared at /System/Library/Frameworks/ApplicationServices.framework/Frameworks/QD.framework/Headers/QDOffscreen.h:196)
highgui/cvcap_qt.cpp:524: warning: 'UnlockPixels' is deprecated (declared at /System/Library/Frameworks/ApplicationServices.framework/Frameworks/QD.framework/Headers/QDOffscreen.h:196)
highgui/cvcap_qt.cpp: In function 'int icvOpenCamera_QT(CvCapture_QT_Cam*, int)':
highgui/cvcap_qt.cpp:981: warning: 'DisposeGWorld' is deprecated (declared at /System/Library/Frameworks/ApplicationServices.framework/Frameworks/QD.framework/Headers/QDOffscreen.h:226)
highgui/cvcap_qt.cpp:981: warning: 'DisposeGWorld' is deprecated (declared at /System/Library/Frameworks/ApplicationServices.framework/Frameworks/QD.framework/Headers/QDOffscreen.h:226)
highgui/cvcap_qt.cpp:996: warning: 'GetGWorldPixMap' is deprecated (declared at /System/Library/Frameworks/ApplicationServices.framework/Frameworks/QD.framework/Headers/QDOffscreen.h:480)
highgui/cvcap_qt.cpp:996: warning: 'GetGWorldPixMap' is deprecated (declared at /System/Library/Frameworks/ApplicationServices.framework/Frameworks/QD.framework/Headers/QDOffscreen.h:480)
highgui/cvcap_qt.cpp:998: warning: 'LockPixels' is deprecated (declared at /System/Library/Frameworks/ApplicationServices.framework/Frameworks/QD.framework/Headers/QDOffscreen.h:184)
highgui/cvcap_qt.cpp:998: warning: 'LockPixels' is deprecated (declared at /System/Library/Frameworks/ApplicationServices.framework/Frameworks/QD.framework/Headers/QDOffscreen.h:184)
highgui/cvcap_qt.cpp:999: warning: 'GetPixBaseAddr' is deprecated (declared at /System/Library/Frameworks/ApplicationServices.framework/Frameworks/QD.framework/Headers/QDOffscreen.h:364)
highgui/cvcap_qt.cpp:999: warning: 'GetPixBaseAddr' is deprecated (declared at /System/Library/Frameworks/ApplicationServices.framework/Frameworks/QD.framework/Headers/QDOffscreen.h:364)
highgui/cvcap_qt.cpp:999: warning: 'GetPixRowBytes' is deprecated (declared at /System/Library/Frameworks/ApplicationServices.framework/Frameworks/QD.framework/Headers/QDOffscreen.h:376)
highgui/cvcap_qt.cpp:999: warning: 'GetPixRowBytes' is deprecated (declared at /System/Library/Frameworks/ApplicationServices.framework/Frameworks/QD.framework/Headers/QDOffscreen.h:376)
highgui/cvcap_qt.cpp: In function 'int icvClose_QT_Cam(CvCapture_QT_Cam*)':
highgui/cvcap_qt.cpp:1039: warning: 'DisposeGWorld' is deprecated (declared at /System/Library/Frameworks/ApplicationServices.framework/Frameworks/QD.framework/Headers/QDOffscreen.h:226)
highgui/cvcap_qt.cpp:1039: warning: 'DisposeGWorld' is deprecated (declared at /System/Library/Frameworks/ApplicationServices.framework/Frameworks/QD.framework/Headers/QDOffscreen.h:226)
mv -f .deps/lib_highgui_la-cvcap_qt.Tpo .deps/lib_highgui_la-cvcap_qt.Plo
/bin/sh ../libtool  --tag=CXX   --mode=compile /usr/bin/g++-4.0 -DHAVE_CONFIG_H -I. -I..  -DNDEBUG  -I../include/opencv -I/opt/local/include -fast -g  -O2 -arch i386 -MT lib_highgui_la-window_carbon.lo -MD -MP -MF .deps/lib_highgui_la-window_carbon.Tpo -c -o lib_highgui_la-window_carbon.lo `test -f 'highgui/window_carbon.cpp' || echo './'`highgui/window_carbon.cpp
libtool: compile:  /usr/bin/g++-4.0 -DHAVE_CONFIG_H -I. -I.. -DNDEBUG -I../include/opencv -I/opt/local/include -fast -g -O2 -arch i386 -MT lib_highgui_la-window_carbon.lo -MD -MP -MF .deps/lib_highgui_la-window_carbon.Tpo -c highgui/window_carbon.cpp  -fno-common -DPIC -o .libs/lib_highgui_la-window_carbon.o
mv -f .deps/lib_highgui_la-window_carbon.Tpo .deps/lib_highgui_la-window_carbon.Plo
/bin/sh ../libtool  --tag=CXX   --mode=compile /usr/bin/g++-4.0 -DHAVE_CONFIG_H -I. -I..  -DNDEBUG  -I../include/opencv -I/opt/local/include -fast -g  -O2 -arch i386 -MT lib_highgui_la-grfmt_imageio.lo -MD -MP -MF .deps/lib_highgui_la-grfmt_imageio.Tpo -c -o lib_highgui_la-grfmt_imageio.lo `test -f 'highgui/grfmt_imageio.cpp' || echo './'`highgui/grfmt_imageio.cpp
libtool: compile:  /usr/bin/g++-4.0 -DHAVE_CONFIG_H -I. -I.. -DNDEBUG -I../include/opencv -I/opt/local/include -fast -g -O2 -arch i386 -MT lib_highgui_la-grfmt_imageio.lo -MD -MP -MF .deps/lib_highgui_la-grfmt_imageio.Tpo -c highgui/grfmt_imageio.cpp  -fno-common -DPIC -o .libs/lib_highgui_la-grfmt_imageio.o
highgui/grfmt_imageio.cpp: In member function 'virtual bool cv::ImageIODecoder::readData(cv::Mat&)':
highgui/grfmt_imageio.cpp:116: error: 'kCGColorSpaceGenericRGBLinear' was not declared in this scope
highgui/grfmt_imageio.cpp: In member function 'virtual bool cv::ImageIOEncoder::write(const cv::Mat&, const std::vector<int, std::allocator<int> >&)':
highgui/grfmt_imageio.cpp:278: error: 'kCGColorSpaceGenericRGBLinear' was not declared in this scope
make[2]: *** [lib_highgui_la-grfmt_imageio.lo] Error 1
make[1]: *** [all-recursive] Error 1
make: *** [all] Error 2

Error: Status 1 encountered during processing.
#40764 opencv camera initialization fails stromnov@… defect Normal ports

Reported by karo03de@…, 18 months ago.

Description

Camera init fails with opencv 2.4.6.1_0 and 2.4.6.1_1. Perhaps this is a bug, already repaired in opencv (http://code.opencv.org/issues/3156)?

#42390 OpenCV: CMake configuration files placed in wrong directory stromnov@… defect Normal ports

Reported by sean@…, 14 months ago.

Description

According to the CMake documentation (as of 2.8.12), CMake configuration files for packages should be placed in one of the following directories:

<prefix>/(lib/<arch>|lib|share)/cmake/<name>*/
<prefix>/(lib/<arch>|lib|share)/<name>*/
<prefix>/(lib/<arch>|lib|share)/<name>*/(cmake|CMake)/

However, the current opencv portfile puts the *.cmake files in <prefix>/lib/cmake, which causes CMake's find_package command to fail. The relevant lines from the Portfile:

xinstall -d ${destroot}${prefix}/lib/cmake
move ${destroot}${prefix}/share/OpenCV/OpenCVConfig-version.cmake \
        ${destroot}${prefix}/share/OpenCV/OpenCVConfig.cmake \
        ${destroot}${prefix}/share/OpenCV/OpenCVModules.cmake \
        ${destroot}${prefix}/share/OpenCV/OpenCVModules-release.cmake \
        ${destroot}${prefix}/lib/cmake/

Suggest that this post-destroot step be removed since it looks like the *.cmake files are already in a location where CMake can find them, under ${destroot}${prefix}/share/OpenCV/.

Patch attached.

#36841 opencv: compile with headerpad_max_install_names flag stromnov@… enhancement Normal ports

Reported by luc.jean@…, 2 years ago.

Description

Hello,

I have an issue when making an app bundle for a opencv/python app with py2app.

The py2app maintainer said:

Shared libraries on OSX contain an absolute path to their location, and likewise all used libraries are also mentioned using an absolute path. Py2app uses macholib to rewrite those mentions to relative paths starting with '@executable_path'. For libraries that are located in /opt/local the new path requires more space than the old one, hence the error message. One way to ensure that there is enough space is the linker flag "headerpad_max_install_names". I don't know how to tell darwinports to add this flag when building opencv.

I don't know either. Does anybody can help me to fix this issue?

Best

#38854 opencv: conflicting declarations macports-tickets@… defect Normal ports

Reported by karo03de@…, 2 years ago.

Description

Using port opencv with tiff throws errors:

/opt/local/include/tiff.h:77: error: conflicting declaration ‘typedef long int int64’ /opt/local/include/opencv2/core/types_c.h:163: error: ‘int64’ has a previous declaration as ‘typedef int64_t int64’ /opt/local/include/tiff.h:78: error: conflicting declaration ‘typedef long unsigned int uint64’ /opt/local/include/opencv2/core/types_c.h:164: error: ‘uint64’ has a previous declaration as ‘typedef uint64_t uint64’

Replacing line 163-164 in /opt/local/include/opencv2/core/types_c.h

	typedef int64_t int64;
	typedef uint64_t uint64;

by

/* Unsigned 64-bit type */
#ifndef __LP64__
   typedef long long int int64;
   typedef long long unsigned int uint64;
#else /* __LP64__ */
   typedef long int int64;
   typedef long unsigned int uint64;
#endif /* __LP64__ */
/*   typedef int64_t int64; */
/*   typedef uint64_t uint64; */

allows at least for 32 and 64 bit compilation on Mountain Lion, Lion & Leopard!

Although opencv has a quick revision cycle seemingly nobody used this combination of opencv and tiff.

This is a precision (?) or repetition of ticket #38168 since there happened nothing after more than two new revisions of opencv!

#38633 opencv: error: expected initializer before '__AVAILABILITY_INTERNAL__MAC_10_0_DEP__MAC_10_8' stromnov@… defect Normal ports

Reported by cavaquiro@…, 2 years ago.

Description

when I try to install opencv + python27, it appear error, I already clean and try again, but nothing

#30693 opencv: error: non-const static data member must be initialized out of line ryandesign@… defect Normal ports

Reported by saskathex@…, 4 years ago.

Description

Executed a Selfupdate. Cleaned some ports and also cleaned and uninstalled opencv. Reinstalled opencv -> Error

Uninstalled opencv once again and reinstalled.

Attached the log file

#31602 opencv: error: non-const static data member must be initialized out of line macports-tickets@… defect Normal ports

Reported by mgf64mba@…, 3 years ago.

Description

Build of OpenCV fails in OS 6.7.2 with Xcode 4.2 installed

#31686 opencv: error: non-const static data member must be initialized out of line macports-tickets@… defect Normal ports

Reported by genegraphy@…, 3 years ago.

Description
 Target org.macports.build returned: shell command failed (see log for details)
Log for opencv is at: /opt/local/var/macports/logs/_opt_local_var_macports_sources_rsync.macports.org_release_tarballs_ports_graphics_opencv/opencv/main.log
Error: Status 1 encountered during processing.
#31719 opencv: error: non-const static data member must be initialized out of line macports-tickets@… defect Normal ports

Reported by jens.is.located@…, 3 years ago.

Description

Hi,

opencv fails to build with the following error and error log:

 >  sudo port upgrade outdated
--->  Computing dependencies for opencv
--->  Building opencv
Error: Target org.macports.build returned: shell command failed (see log for details)
Log for opencv is at: /opt/local/var/macports/logs/_opt_local_var_macports_sources_rsync.macports.org_release_ports_graphics_opencv/opencv/main.log
Error: Unable to upgrade port: 1
To report a bug, see <http://guide.macports.org/#project.tickets>
version:1
:msg:main --->  Computing dependencies for opencv:info:main .:debug:main Searching for dependency: cmake
:debug:main Found Dependency: receipt exists for cmake
:debug:main Searching for dependency: pkgconfig
:debug:main Found Dependency: receipt exists for pkgconfig
:debug:main Searching for dependency: zlib
:debug:main Found Dependency: receipt exists for zlib
:debug:main Searching for dependency: ffmpeg
:debug:main Found Dependency: receipt exists for ffmpeg
:debug:main Searching for dependency: bzip2
:debug:main Found Dependency: receipt exists for bzip2
:debug:main Searching for dependency: dirac
:debug:main Found Dependency: receipt exists for dirac
:debug:main Searching for dependency: faac
:debug:main Found Dependency: receipt exists for faac
:debug:main Searching for dependency: faad2
:debug:main Found Dependency: receipt exists for faad2
:debug:main Searching for dependency: lame
:debug:main Found Dependency: receipt exists for lame
:debug:main Searching for dependency: schroedinger
:debug:main Found Dependency: receipt exists for schroedinger
:debug:main Searching for dependency: liboil
:debug:main Found Dependency: receipt exists for liboil
:debug:main Searching for dependency: libtheora
:debug:main Found Dependency: receipt exists for libtheora
:debug:main Searching for dependency: libvorbis
:debug:main Found Dependency: receipt exists for libvorbis
:debug:main Searching for dependency: libogg
:debug:main Found Dependency: receipt exists for libogg
:debug:main Searching for dependency: x264
:debug:main Found Dependency: receipt exists for x264
:debug:main Searching for dependency: orc
:debug:main Found Dependency: receipt exists for orc
:msg:main 
:debug:main Executing org.macports.main (opencv)
:debug:main Skipping completed org.macports.archivefetch (opencv)
:debug:main Skipping completed org.macports.fetch (opencv)
:debug:main Skipping completed org.macports.checksum (opencv)
:debug:main Skipping completed org.macports.extract (opencv)
:debug:main Skipping completed org.macports.patch (opencv)
:debug:main Skipping completed org.macports.configure (opencv)
:debug:build build phase started at Sat Oct 22 18:34:58 CEST 2011
:notice:build --->  Building opencv
:debug:build Executing org.macports.build (opencv)
:debug:build Environment: CPATH='/opt/local/include' CC_PRINT_OPTIONS_FILE='/opt/local/var/macports/build/_opt_local_var_macports_sources_rsync.macports.org_release_ports_graphics_opencv/opencv/work/.CC_PRINT_OPTIONS' LIBRARY_PATH='/opt/local/lib' CC_PRINT_OPTIONS='YES' MACOSX_DEPLOYMENT_TARGET='10.6'
:debug:build Assembled command: 'cd "/opt/local/var/macports/build/_opt_local_var_macports_sources_rsync.macports.org_release_ports_graphics_opencv/opencv/work/OpenCV-2.2.0" && /usr/bin/make -j2 -w all'
:debug:build Executing command line:  cd "/opt/local/var/macports/build/_opt_local_var_macports_sources_rsync.macports.org_release_ports_graphics_opencv/opencv/work/OpenCV-2.2.0" && /usr/bin/make -j2 -w all 
:info:build make: Entering directory `/opt/local/var/macports/build/_opt_local_var_macports_sources_rsync.macports.org_release_ports_graphics_opencv/opencv/work/OpenCV-2.2.0'
:info:build /opt/local/bin/cmake -H/opt/local/var/macports/build/_opt_local_var_macports_sources_rsync.macports.org_release_ports_graphics_opencv/opencv/work/OpenCV-2.2.0 -B/opt/local/var/macports/build/_opt_local_var_macports_sources_rsync.macports.org_release_ports_graphics_opencv/opencv/work/OpenCV-2.2.0 --check-build-system CMakeFiles/Makefile.cmake 0
:info:build /opt/local/bin/cmake -E cmake_progress_start /opt/local/var/macports/build/_opt_local_var_macports_sources_rsync.macports.org_release_ports_graphics_opencv/opencv/work/OpenCV-2.2.0/CMakeFiles /opt/local/var/macports/build/_opt_local_var_macports_sources_rsync.macports.org_release_ports_graphics_opencv/opencv/work/OpenCV-2.2.0/CMakeFiles/progress.marks
:info:build /usr/bin/make -f CMakeFiles/Makefile2 all
:info:build make[1]: Entering directory `/opt/local/var/macports/build/_opt_local_var_macports_sources_rsync.macports.org_release_ports_graphics_opencv/opencv/work/OpenCV-2.2.0'
:info:build /usr/bin/make -f 3rdparty/libtiff/CMakeFiles/libtiff.dir/build.make 3rdparty/libtiff/CMakeFiles/libtiff.dir/depend
:info:build /usr/bin/make -f 3rdparty/zlib/CMakeFiles/zlib.dir/build.make 3rdparty/zlib/CMakeFiles/zlib.dir/depend
:info:build make[2]: Entering directory `/opt/local/var/macports/build/_opt_local_var_macports_sources_rsync.macports.org_release_ports_graphics_opencv/opencv/work/OpenCV-2.2.0'
:info:build cd /opt/local/var/macports/build/_opt_local_var_macports_sources_rsync.macports.org_release_ports_graphics_opencv/opencv/work/OpenCV-2.2.0 && /opt/local/bin/cmake -E cmake_depends "Unix Makefiles" /opt/local/var/macports/build/_opt_local_var_macports_sources_rsync.macports.org_release_ports_graphics_opencv/opencv/work/OpenCV-2.2.0 /opt/local/var/macports/build/_opt_local_var_macports_sources_rsync.macports.org_release_ports_graphics_opencv/opencv/work/OpenCV-2.2.0/3rdparty/zlib /opt/local/var/macports/build/_opt_local_var_macports_sources_rsync.macports.org_release_ports_graphics_opencv/opencv/work/OpenCV-2.2.0 /opt/local/var/macports/build/_opt_local_var_macports_sources_rsync.macports.org_release_ports_graphics_opencv/opencv/work/OpenCV-2.2.0/3rdparty/zlib /opt/local/var/macports/build/_opt_local_var_macports_sources_rsync.macports.org_release_ports_graphics_opencv/opencv/work/OpenCV-2.2.0/3rdparty/zlib/CMakeFiles/zlib.dir/DependInfo.cmake --color=
:info:build make[2]: Entering directory `/opt/local/var/macports/build/_opt_local_var_macports_sources_rsync.macports.org_release_ports_graphics_opencv/opencv/work/OpenCV-2.2.0'
:info:build cd /opt/local/var/macports/build/_opt_local_var_macports_sources_rsync.macports.org_release_ports_graphics_opencv/opencv/work/OpenCV-2.2.0 && /opt/local/bin/cmake -E cmake_depends "Unix Makefiles" /opt/local/var/macports/build/_opt_local_var_macports_sources_rsync.macports.org_release_ports_graphics_opencv/opencv/work/OpenCV-2.2.0 /opt/local/var/macports/build/_opt_local_var_macports_sources_rsync.macports.org_release_ports_graphics_opencv/opencv/work/OpenCV-2.2.0/3rdparty/libtiff /opt/local/var/macports/build/_opt_local_var_macports_sources_rsync.macports.org_release_ports_graphics_opencv/opencv/work/OpenCV-2.2.0 /opt/local/var/macports/build/_opt_local_var_macports_sources_rsync.macports.org_release_ports_graphics_opencv/opencv/work/OpenCV-2.2.0/3rdparty/libtiff /opt/local/var/macports/build/_opt_local_var_macports_sources_rsync.macports.org_release_ports_graphics_opencv/opencv/work/OpenCV-2.2.0/3rdparty/libtiff/CMakeFiles/libtiff.dir/DependInfo.cmake --color=
:info:build make[2]: Leaving directory `/opt/local/var/macports/build/_opt_local_var_macports_sources_rsync.macports.org_release_ports_graphics_opencv/opencv/work/OpenCV-2.2.0'
:info:build /usr/bin/make -f 3rdparty/zlib/CMakeFiles/zlib.dir/build.make 3rdparty/zlib/CMakeFiles/zlib.dir/build
:info:build make[2]: Leaving directory `/opt/local/var/macports/build/_opt_local_var_macports_sources_rsync.macports.org_release_ports_graphics_opencv/opencv/work/OpenCV-2.2.0'
:info:build /usr/bin/make -f 3rdparty/libtiff/CMakeFiles/libtiff.dir/build.make 3rdparty/libtiff/CMakeFiles/libtiff.dir/build
:info:build make[2]: Entering directory `/opt/local/var/macports/build/_opt_local_var_macports_sources_rsync.macports.org_release_ports_graphics_opencv/opencv/work/OpenCV-2.2.0'
:info:build make[2]: Nothing to be done for `3rdparty/zlib/CMakeFiles/zlib.dir/build'.
:info:build make[2]: Leaving directory `/opt/local/var/macports/build/_opt_local_var_macports_sources_rsync.macports.org_release_ports_graphics_opencv/opencv/work/OpenCV-2.2.0'
:info:build /opt/local/bin/cmake -E cmake_progress_report /opt/local/var/macports/build/_opt_local_var_macports_sources_rsync.macports.org_release_ports_graphics_opencv/opencv/work/OpenCV-2.2.0/CMakeFiles  99 100
:info:build make[2]: Entering directory `/opt/local/var/macports/build/_opt_local_var_macports_sources_rsync.macports.org_release_ports_graphics_opencv/opencv/work/OpenCV-2.2.0'
:info:build make[2]: Nothing to be done for `3rdparty/libtiff/CMakeFiles/libtiff.dir/build'.
:info:build make[2]: Leaving directory `/opt/local/var/macports/build/_opt_local_var_macports_sources_rsync.macports.org_release_ports_graphics_opencv/opencv/work/OpenCV-2.2.0'
:info:build [  2%] /opt/local/bin/cmake -E cmake_progress_report /opt/local/var/macports/build/_opt_local_var_macports_sources_rsync.macports.org_release_ports_graphics_opencv/opencv/work/OpenCV-2.2.0/CMakeFiles  19 20 21 22
:info:build Built target zlib
:info:build /usr/bin/make -f 3rdparty/lapack/CMakeFiles/opencv_lapack.dir/build.make 3rdparty/lapack/CMakeFiles/opencv_lapack.dir/depend
:info:build [  6%] Built target libtiff
:info:build /usr/bin/make -f 3rdparty/libjasper/CMakeFiles/libjasper.dir/build.make 3rdparty/libjasper/CMakeFiles/libjasper.dir/depend
:info:build make[2]: Entering directory `/opt/local/var/macports/build/_opt_local_var_macports_sources_rsync.macports.org_release_ports_graphics_opencv/opencv/work/OpenCV-2.2.0'
:info:build cd /opt/local/var/macports/build/_opt_local_var_macports_sources_rsync.macports.org_release_ports_graphics_opencv/opencv/work/OpenCV-2.2.0 && /opt/local/bin/cmake -E cmake_depends "Unix Makefiles" /opt/local/var/macports/build/_opt_local_var_macports_sources_rsync.macports.org_release_ports_graphics_opencv/opencv/work/OpenCV-2.2.0 /opt/local/var/macports/build/_opt_local_var_macports_sources_rsync.macports.org_release_ports_graphics_opencv/opencv/work/OpenCV-2.2.0/3rdparty/libjasper /opt/local/var/macports/build/_opt_local_var_macports_sources_rsync.macports.org_release_ports_graphics_opencv/opencv/work/OpenCV-2.2.0 /opt/local/var/macports/build/_opt_local_var_macports_sources_rsync.macports.org_release_ports_graphics_opencv/opencv/work/OpenCV-2.2.0/3rdparty/libjasper /opt/local/var/macports/build/_opt_local_var_macports_sources_rsync.macports.org_release_ports_graphics_opencv/opencv/work/OpenCV-2.2.0/3rdparty/libjasper/CMakeFiles/libjasper.dir/DependInfo.cmake --color=
:info:build make[2]: Leaving directory `/opt/local/var/macports/build/_opt_local_var_macports_sources_rsync.macports.org_release_ports_graphics_opencv/opencv/work/OpenCV-2.2.0'
:info:build /usr/bin/make -f 3rdparty/libjasper/CMakeFiles/libjasper.dir/build.make 3rdparty/libjasper/CMakeFiles/libjasper.dir/build
:info:build make[2]: Entering directory `/opt/local/var/macports/build/_opt_local_var_macports_sources_rsync.macports.org_release_ports_graphics_opencv/opencv/work/OpenCV-2.2.0'
:info:build cd /opt/local/var/macports/build/_opt_local_var_macports_sources_rsync.macports.org_release_ports_graphics_opencv/opencv/work/OpenCV-2.2.0 && /opt/local/bin/cmake -E cmake_depends "Unix Makefiles" /opt/local/var/macports/build/_opt_local_var_macports_sources_rsync.macports.org_release_ports_graphics_opencv/opencv/work/OpenCV-2.2.0 /opt/local/var/macports/build/_opt_local_var_macports_sources_rsync.macports.org_release_ports_graphics_opencv/opencv/work/OpenCV-2.2.0/3rdparty/lapack /opt/local/var/macports/build/_opt_local_var_macports_sources_rsync.macports.org_release_ports_graphics_opencv/opencv/work/OpenCV-2.2.0 /opt/local/var/macports/build/_opt_local_var_macports_sources_rsync.macports.org_release_ports_graphics_opencv/opencv/work/OpenCV-2.2.0/3rdparty/lapack /opt/local/var/macports/build/_opt_local_var_macports_sources_rsync.macports.org_release_ports_graphics_opencv/opencv/work/OpenCV-2.2.0/3rdparty/lapack/CMakeFiles/opencv_lapack.dir/DependInfo.cmake --color=
:info:build make[2]: Entering directory `/opt/local/var/macports/build/_opt_local_var_macports_sources_rsync.macports.org_release_ports_graphics_opencv/opencv/work/OpenCV-2.2.0'
:info:build make[2]: Nothing to be done for `3rdparty/libjasper/CMakeFiles/libjasper.dir/build'.
:info:build make[2]: Leaving directory `/opt/local/var/macports/build/_opt_local_var_macports_sources_rsync.macports.org_release_ports_graphics_opencv/opencv/work/OpenCV-2.2.0'
:info:build /opt/local/bin/cmake -E cmake_progress_report /opt/local/var/macports/build/_opt_local_var_macports_sources_rsync.macports.org_release_ports_graphics_opencv/opencv/work/OpenCV-2.2.0/CMakeFiles  8 9 10 11
:info:build [ 10%] Built target libjasper
:info:build /usr/bin/make -f 3rdparty/libjpeg/CMakeFiles/libjpeg.dir/build.make 3rdparty/libjpeg/CMakeFiles/libjpeg.dir/depend
:info:build make[2]: Entering directory `/opt/local/var/macports/build/_opt_local_var_macports_sources_rsync.macports.org_release_ports_graphics_opencv/opencv/work/OpenCV-2.2.0'
:info:build cd /opt/local/var/macports/build/_opt_local_var_macports_sources_rsync.macports.org_release_ports_graphics_opencv/opencv/work/OpenCV-2.2.0 && /opt/local/bin/cmake -E cmake_depends "Unix Makefiles" /opt/local/var/macports/build/_opt_local_var_macports_sources_rsync.macports.org_release_ports_graphics_opencv/opencv/work/OpenCV-2.2.0 /opt/local/var/macports/build/_opt_local_var_macports_sources_rsync.macports.org_release_ports_graphics_opencv/opencv/work/OpenCV-2.2.0/3rdparty/libjpeg /opt/local/var/macports/build/_opt_local_var_macports_sources_rsync.macports.org_release_ports_graphics_opencv/opencv/work/OpenCV-2.2.0 /opt/local/var/macports/build/_opt_local_var_macports_sources_rsync.macports.org_release_ports_graphics_opencv/opencv/work/OpenCV-2.2.0/3rdparty/libjpeg /opt/local/var/macports/build/_opt_local_var_macports_sources_rsync.macports.org_release_ports_graphics_opencv/opencv/work/OpenCV-2.2.0/3rdparty/libjpeg/CMakeFiles/libjpeg.dir/DependInfo.cmake --color=
:info:build make[2]: Leaving directory `/opt/local/var/macports/build/_opt_local_var_macports_sources_rsync.macports.org_release_ports_graphics_opencv/opencv/work/OpenCV-2.2.0'
:info:build /usr/bin/make -f 3rdparty/lapack/CMakeFiles/opencv_lapack.dir/build.make 3rdparty/lapack/CMakeFiles/opencv_lapack.dir/build
:info:build make[2]: Leaving directory `/opt/local/var/macports/build/_opt_local_var_macports_sources_rsync.macports.org_release_ports_graphics_opencv/opencv/work/OpenCV-2.2.0'
:info:build /usr/bin/make -f 3rdparty/libjpeg/CMakeFiles/libjpeg.dir/build.make 3rdparty/libjpeg/CMakeFiles/libjpeg.dir/build
:info:build make[2]: Entering directory `/opt/local/var/macports/build/_opt_local_var_macports_sources_rsync.macports.org_release_ports_graphics_opencv/opencv/work/OpenCV-2.2.0'
:info:build make[2]: Nothing to be done for `3rdparty/libjpeg/CMakeFiles/libjpeg.dir/build'.
:info:build make[2]: Leaving directory `/opt/local/var/macports/build/_opt_local_var_macports_sources_rsync.macports.org_release_ports_graphics_opencv/opencv/work/OpenCV-2.2.0'
:info:build /opt/local/bin/cmake -E cmake_progress_report /opt/local/var/macports/build/_opt_local_var_macports_sources_rsync.macports.org_release_ports_graphics_opencv/opencv/work/OpenCV-2.2.0/CMakeFiles  12 13 14 15 16
:info:build [ 15%] Built target libjpeg
:info:build /usr/bin/make -f 3rdparty/libpng/CMakeFiles/libpng.dir/build.make 3rdparty/libpng/CMakeFiles/libpng.dir/depend
:info:build make[2]: Entering directory `/opt/local/var/macports/build/_opt_local_var_macports_sources_rsync.macports.org_release_ports_graphics_opencv/opencv/work/OpenCV-2.2.0'
:info:build cd /opt/local/var/macports/build/_opt_local_var_macports_sources_rsync.macports.org_release_ports_graphics_opencv/opencv/work/OpenCV-2.2.0 && /opt/local/bin/cmake -E cmake_depends "Unix Makefiles" /opt/local/var/macports/build/_opt_local_var_macports_sources_rsync.macports.org_release_ports_graphics_opencv/opencv/work/OpenCV-2.2.0 /opt/local/var/macports/build/_opt_local_var_macports_sources_rsync.macports.org_release_ports_graphics_opencv/opencv/work/OpenCV-2.2.0/3rdparty/libpng /opt/local/var/macports/build/_opt_local_var_macports_sources_rsync.macports.org_release_ports_graphics_opencv/opencv/work/OpenCV-2.2.0 /opt/local/var/macports/build/_opt_local_var_macports_sources_rsync.macports.org_release_ports_graphics_opencv/opencv/work/OpenCV-2.2.0/3rdparty/libpng /opt/local/var/macports/build/_opt_local_var_macports_sources_rsync.macports.org_release_ports_graphics_opencv/opencv/work/OpenCV-2.2.0/3rdparty/libpng/CMakeFiles/libpng.dir/DependInfo.cmake --color=
:info:build make[2]: Entering directory `/opt/local/var/macports/build/_opt_local_var_macports_sources_rsync.macports.org_release_ports_graphics_opencv/opencv/work/OpenCV-2.2.0'
:info:build make[2]: Nothing to be done for `3rdparty/lapack/CMakeFiles/opencv_lapack.dir/build'.
:info:build make[2]: Leaving directory `/opt/local/var/macports/build/_opt_local_var_macports_sources_rsync.macports.org_release_ports_graphics_opencv/opencv/work/OpenCV-2.2.0'
:info:build /opt/local/bin/cmake -E cmake_progress_report /opt/local/var/macports/build/_opt_local_var_macports_sources_rsync.macports.org_release_ports_graphics_opencv/opencv/work/OpenCV-2.2.0/CMakeFiles  40 41 42 43 44 45 46 47 48 49 50 51 52 53 54 55 56 57 58 59 60 61 62 63 64 65 66 67 68 69 70 71 72
:info:build make[2]: Leaving directory `/opt/local/var/macports/build/_opt_local_var_macports_sources_rsync.macports.org_release_ports_graphics_opencv/opencv/work/OpenCV-2.2.0'
:info:build /usr/bin/make -f 3rdparty/libpng/CMakeFiles/libpng.dir/build.make 3rdparty/libpng/CMakeFiles/libpng.dir/build
:info:build [ 48%] Built target opencv_lapack
:info:build /usr/bin/make -f doc/CMakeFiles/DOXY_HTML.dir/build.make doc/CMakeFiles/DOXY_HTML.dir/depend
:info:build make[2]: Entering directory `/opt/local/var/macports/build/_opt_local_var_macports_sources_rsync.macports.org_release_ports_graphics_opencv/opencv/work/OpenCV-2.2.0'
:info:build make[2]: Nothing to be done for `3rdparty/libpng/CMakeFiles/libpng.dir/build'.
:info:build make[2]: Leaving directory `/opt/local/var/macports/build/_opt_local_var_macports_sources_rsync.macports.org_release_ports_graphics_opencv/opencv/work/OpenCV-2.2.0'
:info:build /opt/local/bin/cmake -E cmake_progress_report /opt/local/var/macports/build/_opt_local_var_macports_sources_rsync.macports.org_release_ports_graphics_opencv/opencv/work/OpenCV-2.2.0/CMakeFiles  17 18
:info:build make[2]: Entering directory `/opt/local/var/macports/build/_opt_local_var_macports_sources_rsync.macports.org_release_ports_graphics_opencv/opencv/work/OpenCV-2.2.0'
:info:build cd /opt/local/var/macports/build/_opt_local_var_macports_sources_rsync.macports.org_release_ports_graphics_opencv/opencv/work/OpenCV-2.2.0 && /opt/local/bin/cmake -E cmake_depends "Unix Makefiles" /opt/local/var/macports/build/_opt_local_var_macports_sources_rsync.macports.org_release_ports_graphics_opencv/opencv/work/OpenCV-2.2.0 /opt/local/var/macports/build/_opt_local_var_macports_sources_rsync.macports.org_release_ports_graphics_opencv/opencv/work/OpenCV-2.2.0/doc /opt/local/var/macports/build/_opt_local_var_macports_sources_rsync.macports.org_release_ports_graphics_opencv/opencv/work/OpenCV-2.2.0 /opt/local/var/macports/build/_opt_local_var_macports_sources_rsync.macports.org_release_ports_graphics_opencv/opencv/work/OpenCV-2.2.0/doc /opt/local/var/macports/build/_opt_local_var_macports_sources_rsync.macports.org_release_ports_graphics_opencv/opencv/work/OpenCV-2.2.0/doc/CMakeFiles/DOXY_HTML.dir/DependInfo.cmake --color=
:info:build [ 50%] Built target libpng
:info:build /usr/bin/make -f modules/core/CMakeFiles/opencv_core.dir/build.make modules/core/CMakeFiles/opencv_core.dir/depend
:info:build make[2]: Entering directory `/opt/local/var/macports/build/_opt_local_var_macports_sources_rsync.macports.org_release_ports_graphics_opencv/opencv/work/OpenCV-2.2.0'
:info:build cd /opt/local/var/macports/build/_opt_local_var_macports_sources_rsync.macports.org_release_ports_graphics_opencv/opencv/work/OpenCV-2.2.0 && /opt/local/bin/cmake -E cmake_depends "Unix Makefiles" /opt/local/var/macports/build/_opt_local_var_macports_sources_rsync.macports.org_release_ports_graphics_opencv/opencv/work/OpenCV-2.2.0 /opt/local/var/macports/build/_opt_local_var_macports_sources_rsync.macports.org_release_ports_graphics_opencv/opencv/work/OpenCV-2.2.0/modules/core /opt/local/var/macports/build/_opt_local_var_macports_sources_rsync.macports.org_release_ports_graphics_opencv/opencv/work/OpenCV-2.2.0 /opt/local/var/macports/build/_opt_local_var_macports_sources_rsync.macports.org_release_ports_graphics_opencv/opencv/work/OpenCV-2.2.0/modules/core /opt/local/var/macports/build/_opt_local_var_macports_sources_rsync.macports.org_release_ports_graphics_opencv/opencv/work/OpenCV-2.2.0/modules/core/CMakeFiles/opencv_core.dir/DependInfo.cmake --color=
:info:build make[2]: Leaving directory `/opt/local/var/macports/build/_opt_local_var_macports_sources_rsync.macports.org_release_ports_graphics_opencv/opencv/work/OpenCV-2.2.0'
:info:build /usr/bin/make -f doc/CMakeFiles/DOXY_HTML.dir/build.make doc/CMakeFiles/DOXY_HTML.dir/build
:info:build make[2]: Entering directory `/opt/local/var/macports/build/_opt_local_var_macports_sources_rsync.macports.org_release_ports_graphics_opencv/opencv/work/OpenCV-2.2.0'
:info:build cd /opt/local/var/macports/build/_opt_local_var_macports_sources_rsync.macports.org_release_ports_graphics_opencv/opencv/work/OpenCV-2.2.0/doc && /opt/local/bin/doxygen /opt/local/var/macports/build/_opt_local_var_macports_sources_rsync.macports.org_release_ports_graphics_opencv/opencv/work/OpenCV-2.2.0/doc/Doxyfile
:info:build make[2]: Leaving directory `/opt/local/var/macports/build/_opt_local_var_macports_sources_rsync.macports.org_release_ports_graphics_opencv/opencv/work/OpenCV-2.2.0'
:info:build /usr/bin/make -f modules/core/CMakeFiles/opencv_core.dir/build.make modules/core/CMakeFiles/opencv_core.dir/build
:info:build make[2]: Entering directory `/opt/local/var/macports/build/_opt_local_var_macports_sources_rsync.macports.org_release_ports_graphics_opencv/opencv/work/OpenCV-2.2.0'
:info:build make[2]: Nothing to be done for `modules/core/CMakeFiles/opencv_core.dir/build'.
:info:build make[2]: Leaving directory `/opt/local/var/macports/build/_opt_local_var_macports_sources_rsync.macports.org_release_ports_graphics_opencv/opencv/work/OpenCV-2.2.0'
:info:build /opt/local/bin/cmake -E cmake_progress_report /opt/local/var/macports/build/_opt_local_var_macports_sources_rsync.macports.org_release_ports_graphics_opencv/opencv/work/OpenCV-2.2.0/CMakeFiles  25 26 27
:info:build warning: Tag `MAX_DOT_GRAPH_WIDTH' at line 116 of file /opt/local/var/macports/build/_opt_local_var_macports_sources_rsync.macports.org_release_ports_graphics_opencv/opencv/work/OpenCV-2.2.0/doc/Doxyfile has become obsolete.
:info:build To avoid this warning please update your configuration file using "doxygen -u"
:info:build warning: Tag `MAX_DOT_GRAPH_HEIGHT' at line 117 of file /opt/local/var/macports/build/_opt_local_var_macports_sources_rsync.macports.org_release_ports_graphics_opencv/opencv/work/OpenCV-2.2.0/doc/Doxyfile has become obsolete.
:info:build To avoid this warning please update your configuration file using "doxygen -u"
:info:build [ 53%] Built target opencv_core
:info:build /usr/bin/make -f modules/imgproc/CMakeFiles/opencv_imgproc.dir/build.make modules/imgproc/CMakeFiles/opencv_imgproc.dir/depend
:info:build make[2]: Entering directory `/opt/local/var/macports/build/_opt_local_var_macports_sources_rsync.macports.org_release_ports_graphics_opencv/opencv/work/OpenCV-2.2.0'
:info:build cd /opt/local/var/macports/build/_opt_local_var_macports_sources_rsync.macports.org_release_ports_graphics_opencv/opencv/work/OpenCV-2.2.0 && /opt/local/bin/cmake -E cmake_depends "Unix Makefiles" /opt/local/var/macports/build/_opt_local_var_macports_sources_rsync.macports.org_release_ports_graphics_opencv/opencv/work/OpenCV-2.2.0 /opt/local/var/macports/build/_opt_local_var_macports_sources_rsync.macports.org_release_ports_graphics_opencv/opencv/work/OpenCV-2.2.0/modules/imgproc /opt/local/var/macports/build/_opt_local_var_macports_sources_rsync.macports.org_release_ports_graphics_opencv/opencv/work/OpenCV-2.2.0 /opt/local/var/macports/build/_opt_local_var_macports_sources_rsync.macports.org_release_ports_graphics_opencv/opencv/work/OpenCV-2.2.0/modules/imgproc /opt/local/var/macports/build/_opt_local_var_macports_sources_rsync.macports.org_release_ports_graphics_opencv/opencv/work/OpenCV-2.2.0/modules/imgproc/CMakeFiles/opencv_imgproc.dir/DependInfo.cmake --color=
:info:build /opt/local/var/macports/build/_opt_local_var_macports_sources_rsync.macports.org_release_ports_graphics_opencv/opencv/work/OpenCV-2.2.0/modules/core/include/opencv2/core/core.hpp:685: Empty prototype found!
:info:build /opt/local/var/macports/build/_opt_local_var_macports_sources_rsync.macports.org_release_ports_graphics_opencv/opencv/work/OpenCV-2.2.0/modules/core/include/opencv2/core/core.hpp:854: Empty prototype found!
:info:build make[2]: Leaving directory `/opt/local/var/macports/build/_opt_local_var_macports_sources_rsync.macports.org_release_ports_graphics_opencv/opencv/work/OpenCV-2.2.0'
:info:build /usr/bin/make -f modules/imgproc/CMakeFiles/opencv_imgproc.dir/build.make modules/imgproc/CMakeFiles/opencv_imgproc.dir/build
:info:build make[2]: Entering directory `/opt/local/var/macports/build/_opt_local_var_macports_sources_rsync.macports.org_release_ports_graphics_opencv/opencv/work/OpenCV-2.2.0'
:info:build make[2]: Nothing to be done for `modules/imgproc/CMakeFiles/opencv_imgproc.dir/build'.
:info:build make[2]: Leaving directory `/opt/local/var/macports/build/_opt_local_var_macports_sources_rsync.macports.org_release_ports_graphics_opencv/opencv/work/OpenCV-2.2.0'
:info:build /opt/local/bin/cmake -E cmake_progress_report /opt/local/var/macports/build/_opt_local_var_macports_sources_rsync.macports.org_release_ports_graphics_opencv/opencv/work/OpenCV-2.2.0/CMakeFiles  35 36 37 38 39
:info:build [ 58%] Built target opencv_imgproc
:info:build /usr/bin/make -f modules/flann/CMakeFiles/opencv_flann.dir/build.make modules/flann/CMakeFiles/opencv_flann.dir/depend
:info:build make[2]: Entering directory `/opt/local/var/macports/build/_opt_local_var_macports_sources_rsync.macports.org_release_ports_graphics_opencv/opencv/work/OpenCV-2.2.0'
:info:build cd /opt/local/var/macports/build/_opt_local_var_macports_sources_rsync.macports.org_release_ports_graphics_opencv/opencv/work/OpenCV-2.2.0 && /opt/local/bin/cmake -E cmake_depends "Unix Makefiles" /opt/local/var/macports/build/_opt_local_var_macports_sources_rsync.macports.org_release_ports_graphics_opencv/opencv/work/OpenCV-2.2.0 /opt/local/var/macports/build/_opt_local_var_macports_sources_rsync.macports.org_release_ports_graphics_opencv/opencv/work/OpenCV-2.2.0/modules/flann /opt/local/var/macports/build/_opt_local_var_macports_sources_rsync.macports.org_release_ports_graphics_opencv/opencv/work/OpenCV-2.2.0 /opt/local/var/macports/build/_opt_local_var_macports_sources_rsync.macports.org_release_ports_graphics_opencv/opencv/work/OpenCV-2.2.0/modules/flann /opt/local/var/macports/build/_opt_local_var_macports_sources_rsync.macports.org_release_ports_graphics_opencv/opencv/work/OpenCV-2.2.0/modules/flann/CMakeFiles/opencv_flann.dir/DependInfo.cmake --color=
:info:build make[2]: Leaving directory `/opt/local/var/macports/build/_opt_local_var_macports_sources_rsync.macports.org_release_ports_graphics_opencv/opencv/work/OpenCV-2.2.0'
:info:build /usr/bin/make -f modules/flann/CMakeFiles/opencv_flann.dir/build.make modules/flann/CMakeFiles/opencv_flann.dir/build
:info:build make[2]: Entering directory `/opt/local/var/macports/build/_opt_local_var_macports_sources_rsync.macports.org_release_ports_graphics_opencv/opencv/work/OpenCV-2.2.0'
:info:build make[2]: Nothing to be done for `modules/flann/CMakeFiles/opencv_flann.dir/build'.
:info:build make[2]: Leaving directory `/opt/local/var/macports/build/_opt_local_var_macports_sources_rsync.macports.org_release_ports_graphics_opencv/opencv/work/OpenCV-2.2.0'
:info:build /opt/local/bin/cmake -E cmake_progress_report /opt/local/var/macports/build/_opt_local_var_macports_sources_rsync.macports.org_release_ports_graphics_opencv/opencv/work/OpenCV-2.2.0/CMakeFiles 
:info:build [ 58%] Built target opencv_flann
:info:build /usr/bin/make -f modules/video/CMakeFiles/opencv_video.dir/build.make modules/video/CMakeFiles/opencv_video.dir/depend
:info:build make[2]: Entering directory `/opt/local/var/macports/build/_opt_local_var_macports_sources_rsync.macports.org_release_ports_graphics_opencv/opencv/work/OpenCV-2.2.0'
:info:build cd /opt/local/var/macports/build/_opt_local_var_macports_sources_rsync.macports.org_release_ports_graphics_opencv/opencv/work/OpenCV-2.2.0 && /opt/local/bin/cmake -E cmake_depends "Unix Makefiles" /opt/local/var/macports/build/_opt_local_var_macports_sources_rsync.macports.org_release_ports_graphics_opencv/opencv/work/OpenCV-2.2.0 /opt/local/var/macports/build/_opt_local_var_macports_sources_rsync.macports.org_release_ports_graphics_opencv/opencv/work/OpenCV-2.2.0/modules/video /opt/local/var/macports/build/_opt_local_var_macports_sources_rsync.macports.org_release_ports_graphics_opencv/opencv/work/OpenCV-2.2.0 /opt/local/var/macports/build/_opt_local_var_macports_sources_rsync.macports.org_release_ports_graphics_opencv/opencv/work/OpenCV-2.2.0/modules/video /opt/local/var/macports/build/_opt_local_var_macports_sources_rsync.macports.org_release_ports_graphics_opencv/opencv/work/OpenCV-2.2.0/modules/video/CMakeFiles/opencv_video.dir/DependInfo.cmake --color=
:info:build make[2]: Leaving directory `/opt/local/var/macports/build/_opt_local_var_macports_sources_rsync.macports.org_release_ports_graphics_opencv/opencv/work/OpenCV-2.2.0'
:info:build /usr/bin/make -f modules/video/CMakeFiles/opencv_video.dir/build.make modules/video/CMakeFiles/opencv_video.dir/build
:info:build make[2]: Entering directory `/opt/local/var/macports/build/_opt_local_var_macports_sources_rsync.macports.org_release_ports_graphics_opencv/opencv/work/OpenCV-2.2.0'
:info:build make[2]: Nothing to be done for `modules/video/CMakeFiles/opencv_video.dir/build'.
:info:build make[2]: Leaving directory `/opt/local/var/macports/build/_opt_local_var_macports_sources_rsync.macports.org_release_ports_graphics_opencv/opencv/work/OpenCV-2.2.0'
:info:build /opt/local/bin/cmake -E cmake_progress_report /opt/local/var/macports/build/_opt_local_var_macports_sources_rsync.macports.org_release_ports_graphics_opencv/opencv/work/OpenCV-2.2.0/CMakeFiles  97 98
:info:build [ 60%] Built target opencv_video
:info:build /usr/bin/make -f modules/ml/CMakeFiles/opencv_ml.dir/build.make modules/ml/CMakeFiles/opencv_ml.dir/depend
:info:build make[2]: Entering directory `/opt/local/var/macports/build/_opt_local_var_macports_sources_rsync.macports.org_release_ports_graphics_opencv/opencv/work/OpenCV-2.2.0'
:info:build cd /opt/local/var/macports/build/_opt_local_var_macports_sources_rsync.macports.org_release_ports_graphics_opencv/opencv/work/OpenCV-2.2.0 && /opt/local/bin/cmake -E cmake_depends "Unix Makefiles" /opt/local/var/macports/build/_opt_local_var_macports_sources_rsync.macports.org_release_ports_graphics_opencv/opencv/work/OpenCV-2.2.0 /opt/local/var/macports/build/_opt_local_var_macports_sources_rsync.macports.org_release_ports_graphics_opencv/opencv/work/OpenCV-2.2.0/modules/ml /opt/local/var/macports/build/_opt_local_var_macports_sources_rsync.macports.org_release_ports_graphics_opencv/opencv/work/OpenCV-2.2.0 /opt/local/var/macports/build/_opt_local_var_macports_sources_rsync.macports.org_release_ports_graphics_opencv/opencv/work/OpenCV-2.2.0/modules/ml /opt/local/var/macports/build/_opt_local_var_macports_sources_rsync.macports.org_release_ports_graphics_opencv/opencv/work/OpenCV-2.2.0/modules/ml/CMakeFiles/opencv_ml.dir/DependInfo.cmake --color=
:info:build make[2]: Leaving directory `/opt/local/var/macports/build/_opt_local_var_macports_sources_rsync.macports.org_release_ports_graphics_opencv/opencv/work/OpenCV-2.2.0'
:info:build /usr/bin/make -f modules/ml/CMakeFiles/opencv_ml.dir/build.make modules/ml/CMakeFiles/opencv_ml.dir/build
:info:build make[2]: Entering directory `/opt/local/var/macports/build/_opt_local_var_macports_sources_rsync.macports.org_release_ports_graphics_opencv/opencv/work/OpenCV-2.2.0'
:info:build make[2]: Nothing to be done for `modules/ml/CMakeFiles/opencv_ml.dir/build'.
:info:build make[2]: Leaving directory `/opt/local/var/macports/build/_opt_local_var_macports_sources_rsync.macports.org_release_ports_graphics_opencv/opencv/work/OpenCV-2.2.0'
:info:build /opt/local/bin/cmake -E cmake_progress_report /opt/local/var/macports/build/_opt_local_var_macports_sources_rsync.macports.org_release_ports_graphics_opencv/opencv/work/OpenCV-2.2.0/CMakeFiles  81
:info:build [ 61%] Built target opencv_ml
:info:build /usr/bin/make -f tests/cxts/CMakeFiles/opencv_ts.dir/build.make tests/cxts/CMakeFiles/opencv_ts.dir/depend
:info:build make[2]: Entering directory `/opt/local/var/macports/build/_opt_local_var_macports_sources_rsync.macports.org_release_ports_graphics_opencv/opencv/work/OpenCV-2.2.0'
:info:build cd /opt/local/var/macports/build/_opt_local_var_macports_sources_rsync.macports.org_release_ports_graphics_opencv/opencv/work/OpenCV-2.2.0 && /opt/local/bin/cmake -E cmake_depends "Unix Makefiles" /opt/local/var/macports/build/_opt_local_var_macports_sources_rsync.macports.org_release_ports_graphics_opencv/opencv/work/OpenCV-2.2.0 /opt/local/var/macports/build/_opt_local_var_macports_sources_rsync.macports.org_release_ports_graphics_opencv/opencv/work/OpenCV-2.2.0/tests/cxts /opt/local/var/macports/build/_opt_local_var_macports_sources_rsync.macports.org_release_ports_graphics_opencv/opencv/work/OpenCV-2.2.0 /opt/local/var/macports/build/_opt_local_var_macports_sources_rsync.macports.org_release_ports_graphics_opencv/opencv/work/OpenCV-2.2.0/tests/cxts /opt/local/var/macports/build/_opt_local_var_macports_sources_rsync.macports.org_release_ports_graphics_opencv/opencv/work/OpenCV-2.2.0/tests/cxts/CMakeFiles/opencv_ts.dir/DependInfo.cmake --color=
:info:build make[2]: Leaving directory `/opt/local/var/macports/build/_opt_local_var_macports_sources_rsync.macports.org_release_ports_graphics_opencv/opencv/work/OpenCV-2.2.0'
:info:build /usr/bin/make -f tests/cxts/CMakeFiles/opencv_ts.dir/build.make tests/cxts/CMakeFiles/opencv_ts.dir/build
:info:build make[2]: Entering directory `/opt/local/var/macports/build/_opt_local_var_macports_sources_rsync.macports.org_release_ports_graphics_opencv/opencv/work/OpenCV-2.2.0'
:info:build make[2]: Nothing to be done for `tests/cxts/CMakeFiles/opencv_ts.dir/build'.
:info:build make[2]: Leaving directory `/opt/local/var/macports/build/_opt_local_var_macports_sources_rsync.macports.org_release_ports_graphics_opencv/opencv/work/OpenCV-2.2.0'
:info:build /opt/local/bin/cmake -E cmake_progress_report /opt/local/var/macports/build/_opt_local_var_macports_sources_rsync.macports.org_release_ports_graphics_opencv/opencv/work/OpenCV-2.2.0/CMakeFiles 
:info:build [ 61%] Built target opencv_ts
:info:build /usr/bin/make -f modules/highgui/CMakeFiles/opencv_highgui.dir/build.make modules/highgui/CMakeFiles/opencv_highgui.dir/depend
:info:build make[2]: Entering directory `/opt/local/var/macports/build/_opt_local_var_macports_sources_rsync.macports.org_release_ports_graphics_opencv/opencv/work/OpenCV-2.2.0'
:info:build cd /opt/local/var/macports/build/_opt_local_var_macports_sources_rsync.macports.org_release_ports_graphics_opencv/opencv/work/OpenCV-2.2.0 && /opt/local/bin/cmake -E cmake_depends "Unix Makefiles" /opt/local/var/macports/build/_opt_local_var_macports_sources_rsync.macports.org_release_ports_graphics_opencv/opencv/work/OpenCV-2.2.0 /opt/local/var/macports/build/_opt_local_var_macports_sources_rsync.macports.org_release_ports_graphics_opencv/opencv/work/OpenCV-2.2.0/modules/highgui /opt/local/var/macports/build/_opt_local_var_macports_sources_rsync.macports.org_release_ports_graphics_opencv/opencv/work/OpenCV-2.2.0 /opt/local/var/macports/build/_opt_local_var_macports_sources_rsync.macports.org_release_ports_graphics_opencv/opencv/work/OpenCV-2.2.0/modules/highgui /opt/local/var/macports/build/_opt_local_var_macports_sources_rsync.macports.org_release_ports_graphics_opencv/opencv/work/OpenCV-2.2.0/modules/highgui/CMakeFiles/opencv_highgui.dir/DependInfo.cmake --color=
:info:build make[2]: Leaving directory `/opt/local/var/macports/build/_opt_local_var_macports_sources_rsync.macports.org_release_ports_graphics_opencv/opencv/work/OpenCV-2.2.0'
:info:build /usr/bin/make -f modules/highgui/CMakeFiles/opencv_highgui.dir/build.make modules/highgui/CMakeFiles/opencv_highgui.dir/build
:info:build make[2]: Entering directory `/opt/local/var/macports/build/_opt_local_var_macports_sources_rsync.macports.org_release_ports_graphics_opencv/opencv/work/OpenCV-2.2.0'
:info:build /opt/local/bin/cmake -E cmake_progress_report /opt/local/var/macports/build/_opt_local_var_macports_sources_rsync.macports.org_release_ports_graphics_opencv/opencv/work/OpenCV-2.2.0/CMakeFiles 33
:info:build [ 62%] Building CXX object modules/highgui/CMakeFiles/opencv_highgui.dir/src/window_cocoa.o
:info:build cd /opt/local/var/macports/build/_opt_local_var_macports_sources_rsync.macports.org_release_ports_graphics_opencv/opencv/work/OpenCV-2.2.0/modules/highgui && /Developer/usr/bin/clang++   -Dopencv_highgui_EXPORTS -DHAVE_ALLOCA -DHAVE_ALLOCA_H -DHAVE_LIBPTHREAD -DHAVE_UNISTD_H -DHAVE_CONFIG_H -DHAVE_JPEG -DHAVE_PNG -DHAVE_TIFF -DHAVE_JASPER -DHAVE_QUICKTIME=1 -DHAVE_COCOA=1 -DHIGHGUI_EXPORTS -DCVAPI_EXPORTS -O2 -arch x86_64    -O3 -DNDEBUG   -arch x86_64 -fPIC -I/opt/local/var/macports/build/_opt_local_var_macports_sources_rsync.macports.org_release_ports_graphics_opencv/opencv/work/OpenCV-2.2.0/. -I/opt/local/var/macports/build/_opt_local_var_macports_sources_rsync.macports.org_release_ports_graphics_opencv/opencv/work/OpenCV-2.2.0 -I/opt/local/var/macports/build/_opt_local_var_macports_sources_rsync.macports.org_release_ports_graphics_opencv/opencv/work/OpenCV-2.2.0/include -I/opt/local/var/macports/build/_opt_local_var_macports_sources_rsync.macports.org_release_ports_graphics_opencv/opencv/work/OpenCV-2.2.0/include/opencv -I/opt/local/var/macports/build/_opt_local_var_macports_sources_rsync.macports.org_release_ports_graphics_opencv/opencv/work/OpenCV-2.2.0/modules/highgui/../../3rdparty/include -I/opt/local/include -I/opt/local/var/macports/build/_opt_local_var_macports_sources_rsync.macports.org_release_ports_graphics_opencv/opencv/work/OpenCV-2.2.0/modules/highgui/include -I/opt/local/var/macports/build/_opt_local_var_macports_sources_rsync.macports.org_release_ports_graphics_opencv/opencv/work/OpenCV-2.2.0/modules/highgui/../core/include -I/opt/local/var/macports/build/_opt_local_var_macports_sources_rsync.macports.org_release_ports_graphics_opencv/opencv/work/OpenCV-2.2.0/modules/highgui/../imgproc/include -I/opt/local/var/macports/build/_opt_local_var_macports_sources_rsync.macports.org_release_ports_graphics_opencv/opencv/work/OpenCV-2.2.0/modules/highgui/src -I/opt/local/var/macports/build/_opt_local_var_macports_sources_rsync.macports.org_release_ports_graphics_opencv/opencv/work/OpenCV-2.2.0/modules/highgui    -o CMakeFiles/opencv_highgui.dir/src/window_cocoa.o -c /opt/local/var/macports/build/_opt_local_var_macports_sources_rsync.macports.org_release_ports_graphics_opencv/opencv/work/OpenCV-2.2.0/modules/highgui/src/window_cocoa.mm
:info:build /opt/local/var/macports/build/_opt_local_var_macports_sources_rsync.macports.org_release_ports_graphics_opencv/opencv/work/OpenCV-2.2.0/modules/core/include/opencv2/core/core.hpp:684: warning: member with no name found.
:info:build /opt/local/var/macports/build/_opt_local_var_macports_sources_rsync.macports.org_release_ports_graphics_opencv/opencv/work/OpenCV-2.2.0/modules/core/include/opencv2/core/core.hpp:851: warning: member with no name found.
:info:build /opt/local/var/macports/build/_opt_local_var_macports_sources_rsync.macports.org_release_ports_graphics_opencv/opencv/work/OpenCV-2.2.0/modules/core/include/opencv2/core/operations.hpp:367: warning: no uniquely matching class member found for 
:info:build   template < _Tp, m, n >
:info:build   Matx< _Tp, m, n > cv::Matx< _Tp, m, n >::diag(const cv::Matx< _Tp, MIN(m, n), 1 > &d)
:info:build Possible candidates:
:info:build   static Matx cv::Matx< _Tp, m, n >::diag(const diag_type &d) at line 463 of file /opt/local/var/macports/build/_opt_local_var_macports_sources_rsync.macports.org_release_ports_graphics_opencv/opencv/work/OpenCV-2.2.0/modules/core/include/opencv2/core/core.hpp
:info:build   Matx< _Tp, MIN(m, n), 1 > cv::Matx< _Tp, m, n >::diag() const  at line 489 of file /opt/local/var/macports/build/_opt_local_var_macports_sources_rsync.macports.org_release_ports_graphics_opencv/opencv/work/OpenCV-2.2.0/modules/core/include/opencv2/core/core.hpp
:info:build 
:info:build /opt/local/var/macports/build/_opt_local_var_macports_sources_rsync.macports.org_release_ports_graphics_opencv/opencv/work/OpenCV-2.2.0/modules/imgproc/include/opencv2/imgproc/imgproc.hpp:805: warning: no matching file member found for 
:info:build void cv::approxPolyDP(const cv::Mat &curve, CV_OUT vector< cv::Point_< float > > &approxCurve, double epsilon, bool closed)Possible candidates:
:info:build   void approxPolyDP(const Mat &curve, CV_OUT vector< Point > &approxCurve, double epsilon, bool closed)
:info:build 
:info:build /opt/local/var/macports/build/_opt_local_var_macports_sources_rsync.macports.org_release_ports_graphics_opencv/opencv/work/OpenCV-2.2.0/modules/imgproc/include/opencv2/imgproc/imgproc.hpp:826: warning: no matching file member found for 
:info:build void cv::convexHull(const cv::Mat &points, CV_OUT vector< cv::Point_< float > > &hull, bool clockwise=false)Possible candidates:
:info:build   void convexHull(const Mat &points, CV_OUT vector< int > &hull, bool clockwise=false)
:info:build   void convexHull(const Mat &points, CV_OUT vector< Point > &hull, bool clockwise=false)
:info:build 
:info:build In file included from /opt/local/var/macports/build/_opt_local_var_macports_sources_rsync.macports.org_release_ports_graphics_opencv/opencv/work/OpenCV-2.2.0/modules/highgui/src/window_cocoa.mm:72:
:info:build In file included from /opt/local/var/macports/build/_opt_local_var_macports_sources_rsync.macports.org_release_ports_graphics_opencv/opencv/work/OpenCV-2.2.0/modules/highgui/src/precomp.hpp:49:
:info:build In file included from /opt/local/var/macports/build/_opt_local_var_macports_sources_rsync.macports.org_release_ports_graphics_opencv/opencv/work/OpenCV-2.2.0/modules/highgui/include/opencv2/highgui/highgui.hpp:46:
:info:build /opt/local/var/macports/build/_opt_local_var_macports_sources_rsync.macports.org_release_ports_graphics_opencv/opencv/work/OpenCV-2.2.0/modules/highgui/../core/include/opencv2/core/core.hpp:432:23: error: non-const static data member must be initialized out of line
:info:build     typedef Matx<_Tp, MIN(m, n), 1> diag_type;
:info:build                       ^~~~~~~~~
:info:build /System/Library/Frameworks/Foundation.framework/Headers/NSObjCRuntime.h:240:39: note: instantiated from:
:info:build     #define MIN(A,B)    ({ __typeof__(A) __a = (A); __typeof__(B) __b = (B); __a < __b ? __a : __b; })
:info:build                                          ^     ~~~
:info:build In file included from /opt/local/var/macports/build/_opt_local_var_macports_sources_rsync.macports.org_release_ports_graphics_opencv/opencv/work/OpenCV-2.2.0/modules/highgui/src/window_cocoa.mm:72:
:info:build In file included from /opt/local/var/macports/build/_opt_local_var_macports_sources_rsync.macports.org_release_ports_graphics_opencv/opencv/work/OpenCV-2.2.0/modules/highgui/src/precomp.hpp:49:
:info:build In file included from /opt/local/var/macports/build/_opt_local_var_macports_sources_rsync.macports.org_release_ports_graphics_opencv/opencv/work/OpenCV-2.2.0/modules/highgui/include/opencv2/highgui/highgui.hpp:46:
:info:build /opt/local/var/macports/build/_opt_local_var_macports_sources_rsync.macports.org_release_ports_graphics_opencv/opencv/work/OpenCV-2.2.0/modules/highgui/../core/include/opencv2/core/core.hpp:432:23: error: non-const static data member must be initialized out of line
:info:build     typedef Matx<_Tp, MIN(m, n), 1> diag_type;
:info:build                       ^~~~~~~~~
:info:build /System/Library/Frameworks/Foundation.framework/Headers/NSObjCRuntime.h:240:64: note: instantiated from:
:info:build     #define MIN(A,B)    ({ __typeof__(A) __a = (A); __typeof__(B) __b = (B); __a < __b ? __a : __b; })
:info:build                                                                   ^     ~~~
:info:build In file included from /opt/local/var/macports/build/_opt_local_var_macports_sources_rsync.macports.org_release_ports_graphics_opencv/opencv/work/OpenCV-2.2.0/modules/highgui/src/window_cocoa.mm:72:
:info:build In file included from /opt/local/var/macports/build/_opt_local_var_macports_sources_rsync.macports.org_release_ports_graphics_opencv/opencv/work/OpenCV-2.2.0/modules/highgui/src/precomp.hpp:49:
:info:build In file included from /opt/local/var/macports/build/_opt_local_var_macports_sources_rsync.macports.org_release_ports_graphics_opencv/opencv/work/OpenCV-2.2.0/modules/highgui/include/opencv2/highgui/highgui.hpp:46:
:info:build /opt/local/var/macports/build/_opt_local_var_macports_sources_rsync.macports.org_release_ports_graphics_opencv/opencv/work/OpenCV-2.2.0/modules/highgui/../core/include/opencv2/core/core.hpp:432:23: error: statement expression not allowed at file scope
:info:build     typedef Matx<_Tp, MIN(m, n), 1> diag_type;
:info:build                       ^
:info:build /System/Library/Frameworks/Foundation.framework/Headers/NSObjCRuntime.h:240:22: note: instantiated from:
:info:build     #define MIN(A,B)    ({ __typeof__(A) __a = (A); __typeof__(B) __b = (B); __a < __b ? __a : __b; })
:info:build                         ^
:info:build In file included from /opt/local/var/macports/build/_opt_local_var_macports_sources_rsync.macports.org_release_ports_graphics_opencv/opencv/work/OpenCV-2.2.0/modules/highgui/src/window_cocoa.mm:72:
:info:build In file included from /opt/local/var/macports/build/_opt_local_var_macports_sources_rsync.macports.org_release_ports_graphics_opencv/opencv/work/OpenCV-2.2.0/modules/highgui/src/precomp.hpp:49:
:info:build In file included from /opt/local/var/macports/build/_opt_local_var_macports_sources_rsync.macports.org_release_ports_graphics_opencv/opencv/work/OpenCV-2.2.0/modules/highgui/include/opencv2/highgui/highgui.hpp:46:
:info:build /opt/local/var/macports/build/_opt_local_var_macports_sources_rsync.macports.org_release_ports_graphics_opencv/opencv/work/OpenCV-2.2.0/modules/highgui/../core/include/opencv2/core/core.hpp:489:15: error: duplicate member '__a'
:info:build     Matx<_Tp, MIN(m,n), 1> diag() const;
:info:build               ^
:info:build /System/Library/Frameworks/Foundation.framework/Headers/NSObjCRuntime.h:240:39: note: instantiated from:
:info:build     #define MIN(A,B)    ({ __typeof__(A) __a = (A); __typeof__(B) __b = (B); __a < __b ? __a : __b; })
:info:build                                          ^
:info:build /opt/local/var/macports/build/_opt_local_var_macports_sources_rsync.macports.org_release_ports_graphics_opencv/opencv/work/OpenCV-2.2.0/modules/highgui/../core/include/opencv2/core/core.hpp:432:23: note: previous declaration is here
:info:build     typedef Matx<_Tp, MIN(m, n), 1> diag_type;
:info:build                       ^
:info:build /System/Library/Frameworks/Foundation.framework/Headers/NSObjCRuntime.h:240:39: note: instantiated from:
:info:build     #define MIN(A,B)    ({ __typeof__(A) __a = (A); __typeof__(B) __b = (B); __a < __b ? __a : __b; })
:info:build                                          ^
:info:build In file included from /opt/local/var/macports/build/_opt_local_var_macports_sources_rsync.macports.org_release_ports_graphics_opencv/opencv/work/OpenCV-2.2.0/modules/highgui/src/window_cocoa.mm:72:
:info:build In file included from /opt/local/var/macports/build/_opt_local_var_macports_sources_rsync.macports.org_release_ports_graphics_opencv/opencv/work/OpenCV-2.2.0/modules/highgui/src/precomp.hpp:49:
:info:build In file included from /opt/local/var/macports/build/_opt_local_var_macports_sources_rsync.macports.org_release_ports_graphics_opencv/opencv/work/OpenCV-2.2.0/modules/highgui/include/opencv2/highgui/highgui.hpp:46:
:info:build /opt/local/var/macports/build/_opt_local_var_macports_sources_rsync.macports.org_release_ports_graphics_opencv/opencv/work/OpenCV-2.2.0/modules/highgui/../core/include/opencv2/core/core.hpp:489:15: error: duplicate member '__b'
:info:build     Matx<_Tp, MIN(m,n), 1> diag() const;
:info:build               ^
:info:build /System/Library/Frameworks/Foundation.framework/Headers/NSObjCRuntime.h:240:64: note: instantiated from:
:info:build     #define MIN(A,B)    ({ __typeof__(A) __a = (A); __typeof__(B) __b = (B); __a < __b ? __a : __b; })
:info:build                                                                   ^
:info:build /opt/local/var/macports/build/_opt_local_var_macports_sources_rsync.macports.org_release_ports_graphics_opencv/opencv/work/OpenCV-2.2.0/modules/highgui/../core/include/opencv2/core/core.hpp:432:23: note: previous declaration is here
:info:build     typedef Matx<_Tp, MIN(m, n), 1> diag_type;
:info:build                       ^
:info:build /System/Library/Frameworks/Foundation.framework/Headers/NSObjCRuntime.h:240:64: note: instantiated from:
:info:build     #define MIN(A,B)    ({ __typeof__(A) __a = (A); __typeof__(B) __b = (B); __a < __b ? __a : __b; })
:info:build                                                                   ^
:info:build In file included from /opt/local/var/macports/build/_opt_local_var_macports_sources_rsync.macports.org_release_ports_graphics_opencv/opencv/work/OpenCV-2.2.0/modules/highgui/src/window_cocoa.mm:72:
:info:build In file included from /opt/local/var/macports/build/_opt_local_var_macports_sources_rsync.macports.org_release_ports_graphics_opencv/opencv/work/OpenCV-2.2.0/modules/highgui/src/precomp.hpp:49:
:info:build In file included from /opt/local/var/macports/build/_opt_local_var_macports_sources_rsync.macports.org_release_ports_graphics_opencv/opencv/work/OpenCV-2.2.0/modules/highgui/include/opencv2/highgui/highgui.hpp:46:
:info:build /opt/local/var/macports/build/_opt_local_var_macports_sources_rsync.macports.org_release_ports_graphics_opencv/opencv/work/OpenCV-2.2.0/modules/highgui/../core/include/opencv2/core/core.hpp:489:15: error: statement expression not allowed at file scope
:info:build     Matx<_Tp, MIN(m,n), 1> diag() const;
:info:build               ^
:info:build /System/Library/Frameworks/Foundation.framework/Headers/NSObjCRuntime.h:240:22: note: instantiated from:
:info:build     #define MIN(A,B)    ({ __typeof__(A) __a = (A); __typeof__(B) __b = (B); __a < __b ? __a : __b; })
:info:build                         ^
:info:build In file included from /opt/local/var/macports/build/_opt_local_var_macports_sources_rsync.macports.org_release_ports_graphics_opencv/opencv/work/OpenCV-2.2.0/modules/highgui/src/window_cocoa.mm:72:
:info:build In file included from /opt/local/var/macports/build/_opt_local_var_macports_sources_rsync.macports.org_release_ports_graphics_opencv/opencv/work/OpenCV-2.2.0/modules/highgui/src/precomp.hpp:49:
:info:build In file included from /opt/local/var/macports/build/_opt_local_var_macports_sources_rsync.macports.org_release_ports_graphics_opencv/opencv/work/OpenCV-2.2.0/modules/highgui/include/opencv2/highgui/highgui.hpp:46:
:info:build /opt/local/var/macports/build/_opt_local_var_macports_sources_rsync.macports.org_release_ports_graphics_opencv/opencv/work/OpenCV-2.2.0/modules/highgui/../core/include/opencv2/core/core.hpp:489:28: error: C++ requires a type specifier for all declarations
:info:build     Matx<_Tp, MIN(m,n), 1> diag() const;
:info:build                            ^~~~
:info:build In file included from /opt/local/var/macports/build/_opt_local_var_macports_sources_rsync.macports.org_release_ports_graphics_opencv/opencv/work/OpenCV-2.2.0/modules/highgui/src/window_cocoa.mm:72:
:info:build In file included from /opt/local/var/macports/build/_opt_local_var_macports_sources_rsync.macports.org_release_ports_graphics_opencv/opencv/work/OpenCV-2.2.0/modules/highgui/src/precomp.hpp:49:
:info:build In file included from /opt/local/var/macports/build/_opt_local_var_macports_sources_rsync.macports.org_release_ports_graphics_opencv/opencv/work/OpenCV-2.2.0/modules/highgui/include/opencv2/highgui/highgui.hpp:46:
:info:build In file included from /opt/local/var/macports/build/_opt_local_var_macports_sources_rsync.macports.org_release_ports_graphics_opencv/opencv/work/OpenCV-2.2.0/modules/highgui/../core/include/opencv2/core/core.hpp:4047:
:info:build /opt/local/var/macports/build/_opt_local_var_macports_sources_rsync.macports.org_release_ports_graphics_opencv/opencv/work/OpenCV-2.2.0/modules/highgui/../core/include/opencv2/core/operations.hpp:366:50: error: duplicate member '__a'
:info:build Matx<_Tp,m,n> Matx<_Tp,m,n>::diag(const Matx<_Tp,MIN(m,n),1>& d)
:info:build                                                  ^
:info:build /System/Library/Frameworks/Foundation.framework/Headers/NSObjCRuntime.h:240:39: note: instantiated from:
:info:build     #define MIN(A,B)    ({ __typeof__(A) __a = (A); __typeof__(B) __b = (B); __a < __b ? __a : __b; })
:info:build                                          ^
:info:build /opt/local/var/macports/build/_opt_local_var_macports_sources_rsync.macports.org_release_ports_graphics_opencv/opencv/work/OpenCV-2.2.0/modules/highgui/../core/include/opencv2/core/core.hpp:432:23: note: previous declaration is here
:info:build     typedef Matx<_Tp, MIN(m, n), 1> diag_type;
:info:build                       ^
:info:build /System/Library/Frameworks/Foundation.framework/Headers/NSObjCRuntime.h:240:39: note: instantiated from:
:info:build     #define MIN(A,B)    ({ __typeof__(A) __a = (A); __typeof__(B) __b = (B); __a < __b ? __a : __b; })
:info:build                                          ^
:info:build In file included from /opt/local/var/macports/build/_opt_local_var_macports_sources_rsync.macports.org_release_ports_graphics_opencv/opencv/work/OpenCV-2.2.0/modules/highgui/src/window_cocoa.mm:72:
:info:build In file included from /opt/local/var/macports/build/_opt_local_var_macports_sources_rsync.macports.org_release_ports_graphics_opencv/opencv/work/OpenCV-2.2.0/modules/highgui/src/precomp.hpp:49:
:info:build In file included from /opt/local/var/macports/build/_opt_local_var_macports_sources_rsync.macports.org_release_ports_graphics_opencv/opencv/work/OpenCV-2.2.0/modules/highgui/include/opencv2/highgui/highgui.hpp:46:
:info:build In file included from /opt/local/var/macports/build/_opt_local_var_macports_sources_rsync.macports.org_release_ports_graphics_opencv/opencv/work/OpenCV-2.2.0/modules/highgui/../core/include/opencv2/core/core.hpp:4047:
:info:build /opt/local/var/macports/build/_opt_local_var_macports_sources_rsync.macports.org_release_ports_graphics_opencv/opencv/work/OpenCV-2.2.0/modules/highgui/../core/include/opencv2/core/operations.hpp:366:50: error: duplicate member '__b'
:info:build Matx<_Tp,m,n> Matx<_Tp,m,n>::diag(const Matx<_Tp,MIN(m,n),1>& d)
:info:build                                                  ^
:info:build /System/Library/Frameworks/Foundation.framework/Headers/NSObjCRuntime.h:240:64: note: instantiated from:
:info:build     #define MIN(A,B)    ({ __typeof__(A) __a = (A); __typeof__(B) __b = (B); __a < __b ? __a : __b; })
:info:build                                                                   ^
:info:build /opt/local/var/macports/build/_opt_local_var_macports_sources_rsync.macports.org_release_ports_graphics_opencv/opencv/work/OpenCV-2.2.0/modules/highgui/../core/include/opencv2/core/core.hpp:432:23: note: previous declaration is here
:info:build     typedef Matx<_Tp, MIN(m, n), 1> diag_type;
:info:build                       ^
:info:build /System/Library/Frameworks/Foundation.framework/Headers/NSObjCRuntime.h:240:64: note: instantiated from:
:info:build     #define MIN(A,B)    ({ __typeof__(A) __a = (A); __typeof__(B) __b = (B); __a < __b ? __a : __b; })
:info:build                                                                   ^
:info:build In file included from /opt/local/var/macports/build/_opt_local_var_macports_sources_rsync.macports.org_release_ports_graphics_opencv/opencv/work/OpenCV-2.2.0/modules/highgui/src/window_cocoa.mm:72:
:info:build In file included from /opt/local/var/macports/build/_opt_local_var_macports_sources_rsync.macports.org_release_ports_graphics_opencv/opencv/work/OpenCV-2.2.0/modules/highgui/src/precomp.hpp:49:
:info:build In file included from /opt/local/var/macports/build/_opt_local_var_macports_sources_rsync.macports.org_release_ports_graphics_opencv/opencv/work/OpenCV-2.2.0/modules/highgui/include/opencv2/highgui/highgui.hpp:46:
:info:build In file included from /opt/local/var/macports/build/_opt_local_var_macports_sources_rsync.macports.org_release_ports_graphics_opencv/opencv/work/OpenCV-2.2.0/modules/highgui/../core/include/opencv2/core/core.hpp:4047:
:info:build /opt/local/var/macports/build/_opt_local_var_macports_sources_rsync.macports.org_release_ports_graphics_opencv/opencv/work/OpenCV-2.2.0/modules/highgui/../core/include/opencv2/core/operations.hpp:366:50: error: statement expression not allowed at file scope
:info:build Matx<_Tp,m,n> Matx<_Tp,m,n>::diag(const Matx<_Tp,MIN(m,n),1>& d)
:info:build                                                  ^
:info:build /System/Library/Frameworks/Foundation.framework/Headers/NSObjCRuntime.h:240:22: note: instantiated from:
:info:build     #define MIN(A,B)    ({ __typeof__(A) __a = (A); __typeof__(B) __b = (B); __a < __b ? __a : __b; })
:info:build                         ^
:info:build In file included from /opt/local/var/macports/build/_opt_local_var_macports_sources_rsync.macports.org_release_ports_graphics_opencv/opencv/work/OpenCV-2.2.0/modules/highgui/src/window_cocoa.mm:72:
:info:build In file included from /opt/local/var/macports/build/_opt_local_var_macports_sources_rsync.macports.org_release_ports_graphics_opencv/opencv/work/OpenCV-2.2.0/modules/highgui/src/precomp.hpp:49:
:info:build In file included from /opt/local/var/macports/build/_opt_local_var_macports_sources_rsync.macports.org_release_ports_graphics_opencv/opencv/work/OpenCV-2.2.0/modules/highgui/include/opencv2/highgui/highgui.hpp:46:
:info:build In file included from /opt/local/var/macports/build/_opt_local_var_macports_sources_rsync.macports.org_release_ports_graphics_opencv/opencv/work/OpenCV-2.2.0/modules/highgui/../core/include/opencv2/core/core.hpp:4047:
:info:build /opt/local/var/macports/build/_opt_local_var_macports_sources_rsync.macports.org_release_ports_graphics_opencv/opencv/work/OpenCV-2.2.0/modules/highgui/../core/include/opencv2/core/operations.hpp:442:11: error: statement expression not allowed at file scope
:info:build Matx<_Tp, MIN(m,n), 1> Matx<_Tp, m, n>::diag() const
:info:build           ^
:info:build /System/Library/Frameworks/Foundation.framework/Headers/NSObjCRuntime.h:240:22: note: instantiated from:
:info:build     #define MIN(A,B)    ({ __typeof__(A) __a = (A); __typeof__(B) __b = (B); __a < __b ? __a : __b; })
:info:build                         ^
:info:build In file included from /opt/local/var/macports/build/_opt_local_var_macports_sources_rsync.macports.org_release_ports_graphics_opencv/opencv/work/OpenCV-2.2.0/modules/highgui/src/window_cocoa.mm:72:
:info:build In file included from /opt/local/var/macports/build/_opt_local_var_macports_sources_rsync.macports.org_release_ports_graphics_opencv/opencv/work/OpenCV-2.2.0/modules/highgui/src/precomp.hpp:49:
:info:build In file included from /opt/local/var/macports/build/_opt_local_var_macports_sources_rsync.macports.org_release_ports_graphics_opencv/opencv/work/OpenCV-2.2.0/modules/highgui/include/opencv2/highgui/highgui.hpp:46:
:info:build In file included from /opt/local/var/macports/build/_opt_local_var_macports_sources_rsync.macports.org_release_ports_graphics_opencv/opencv/work/OpenCV-2.2.0/modules/highgui/../core/include/opencv2/core/core.hpp:4047:
:info:build /opt/local/var/macports/build/_opt_local_var_macports_sources_rsync.macports.org_release_ports_graphics_opencv/opencv/work/OpenCV-2.2.0/modules/highgui/../core/include/opencv2/core/operations.hpp:446:11: error: member reference base type 'diag_type' (aka 'int') is not a structure or union
:info:build         d.val[i] = val[i*n + i];
:info:build         ~ ^
:info:build /opt/local/var/macports/build/_opt_local_var_macports_sources_rsync.macports.org_release_ports_graphics_opencv/opencv/work/OpenCV-2.2.0/modules/highgui/../core/include/opencv2/core/operations.hpp:2221:11: error: unknown type name 'Vector'
:info:build dot(const Vector<_Tp>& v1, const Vector<_Tp>& v2)
:info:build           ^
:info:build /opt/local/var/macports/build/_opt_local_var_macports_sources_rsync.macports.org_release_ports_graphics_opencv/opencv/work/OpenCV-2.2.0/modules/highgui/../core/include/opencv2/core/operations.hpp:2221:17: error: expected ')'
:info:build dot(const Vector<_Tp>& v1, const Vector<_Tp>& v2)
:info:build                 ^
:info:build /opt/local/var/macports/build/_opt_local_var_macports_sources_rsync.macports.org_release_ports_graphics_opencv/opencv/work/OpenCV-2.2.0/modules/highgui/../core/include/opencv2/core/operations.hpp:2221:4: note: to match this '('
:info:build dot(const Vector<_Tp>& v1, const Vector<_Tp>& v2)
:info:build    ^
:info:build /opt/local/var/macports/build/_opt_local_var_macports_sources_rsync.macports.org_release_ports_graphics_opencv/opencv/work/OpenCV-2.2.0/modules/highgui/../core/include/opencv2/core/operations.hpp:2224:19: error: use of undeclared identifier 'v1'
:info:build     size_t i, n = v1.size();
:info:build                   ^
:info:build /opt/local/var/macports/build/_opt_local_var_macports_sources_rsync.macports.org_release_ports_graphics_opencv/opencv/work/OpenCV-2.2.0/modules/highgui/../core/include/opencv2/core/operations.hpp:2228:24: error: use of undeclared identifier 'v1'
:info:build     const _Tp *ptr1 = &v1[0], *ptr2 = &v2[0];
:info:build                        ^
:info:build /opt/local/var/macports/build/_opt_local_var_macports_sources_rsync.macports.org_release_ports_graphics_opencv/opencv/work/OpenCV-2.2.0/modules/highgui/../core/include/opencv2/core/operations.hpp:2228:40: error: use of undeclared identifier 'v2'
:info:build     const _Tp *ptr1 = &v1[0], *ptr2 = &v2[0];
:info:build                                        ^
:info:build /opt/local/var/macports/build/_opt_local_var_macports_sources_rsync.macports.org_release_ports_graphics_opencv/opencv/work/OpenCV-2.2.0/modules/highgui/../core/include/opencv2/core/operations.hpp:3299:35: error: invalid operands to binary expression ('const cv::Range' and 'cv::Range')
:info:build     size_t len = !seq ? 0 : range == Range::all() ? seq->total : range.end - range.start;
:info:build                             ~~~~~ ^  ~~~~~~~~~~~~
:info:build /opt/local/var/macports/build/_opt_local_var_macports_sources_rsync.macports.org_release_ports_graphics_opencv/opencv/work/OpenCV-2.2.0/modules/highgui/../core/include/opencv2/core/operations.hpp:2811:20: note: candidate function not viable: no known conversion from 'const cv::Range' to 'const cv::FileNodeIterator' for 1st argument
:info:build static inline bool operator == (const FileNodeIterator& it1, const FileNodeIterator& it2)
:info:build                    ^
:info:build /opt/local/var/macports/build/_opt_local_var_macports_sources_rsync.macports.org_release_ports_graphics_opencv/opencv/work/OpenCV-2.2.0/modules/highgui/../core/include/opencv2/core/operations.hpp:939:6: note: candidate template ignored: failed template argument deduction
:info:build bool operator == (const Matx<_Tp, m, n>& a, const Matx<_Tp, m, n>& b)
:info:build      ^
:info:build 18 errors generated.
:info:build make[2]: *** [modules/highgui/CMakeFiles/opencv_highgui.dir/src/window_cocoa.o] Error 1
:info:build make[2]: Leaving directory `/opt/local/var/macports/build/_opt_local_var_macports_sources_rsync.macports.org_release_ports_graphics_opencv/opencv/work/OpenCV-2.2.0'
:info:build make[1]: *** [modules/highgui/CMakeFiles/opencv_highgui.dir/all] Error 2
:info:build make[1]: *** Waiting for unfinished jobs....
:info:build /opt/local/var/macports/build/_opt_local_var_macports_sources_rsync.macports.org_release_ports_graphics_opencv/opencv/work/OpenCV-2.2.0/modules/core/include/opencv2/core/core.hpp:2011: warning: Unsupported xml/html tag <cmpop> found
:info:build Searching for include files...
:info:build Searching for example files...
:info:build Searching for images...
:info:build Searching for files in directory /opt/local/var/macports/build/_opt_local_var_macports_sources_rsync.macports.org_release_ports_graphics_opencv/opencv/work/OpenCV-2.2.0/doc/pics
:info:build Searching for dot files...
:info:build Searching for msc files...
:info:build Searching for files to exclude
:info:build Searching for files to process...
:info:build Searching for files in directory /opt/local/var/macports/build/_opt_local_var_macports_sources_rsync.macports.org_release_ports_graphics_opencv/opencv/work/OpenCV-2.2.0/modules/core/include/opencv2/core
:info:build Searching for files in directory /opt/local/var/macports/build/_opt_local_var_macports_sources_rsync.macports.org_release_ports_graphics_opencv/opencv/work/OpenCV-2.2.0/modules/imgproc/include/opencv2/imgproc
:info:build Searching for files in directory /opt/local/var/macports/build/_opt_local_var_macports_sources_rsync.macports.org_release_ports_graphics_opencv/opencv/work/OpenCV-2.2.0/modules/calib3d/include/opencv2/calib3d
:info:build Searching for files in directory /opt/local/var/macports/build/_opt_local_var_macports_sources_rsync.macports.org_release_ports_graphics_opencv/opencv/work/OpenCV-2.2.0/modules/features2d/include/opencv2/features2d
:info:build Searching for files in directory /opt/local/var/macports/build/_opt_local_var_macports_sources_rsync.macports.org_release_ports_graphics_opencv/opencv/work/OpenCV-2.2.0/modules/objdetect/include/opencv2/objdetect
:info:build Searching for files in directory /opt/local/var/macports/build/_opt_local_var_macports_sources_rsync.macports.org_release_ports_graphics_opencv/opencv/work/OpenCV-2.2.0/modules/video/include/opencv2/video
:info:build Searching for files in directory /opt/local/var/macports/build/_opt_local_var_macports_sources_rsync.macports.org_release_ports_graphics_opencv/opencv/work/OpenCV-2.2.0/modules/highgui/include/opencv2/highgui
:info:build Searching for files in directory /opt/local/var/macports/build/_opt_local_var_macports_sources_rsync.macports.org_release_ports_graphics_opencv/opencv/work/OpenCV-2.2.0/modules/ml/include/opencv2/ml
:info:build Searching for files in directory /opt/local/var/macports/build/_opt_local_var_macports_sources_rsync.macports.org_release_ports_graphics_opencv/opencv/work/OpenCV-2.2.0/modules/legacy/include/opencv2/legacy
:info:build Searching for files in directory /opt/local/var/macports/build/_opt_local_var_macports_sources_rsync.macports.org_release_ports_graphics_opencv/opencv/work/OpenCV-2.2.0/modules/contrib/include/opencv2/contrib
:info:build Reading and parsing tag files
:info:build Preprocessing /opt/local/var/macports/build/_opt_local_var_macports_sources_rsync.macports.org_release_ports_graphics_opencv/opencv/work/OpenCV-2.2.0/modules/core/include/opencv2/core/core.hpp...
:info:build Parsing file /opt/local/var/macports/build/_opt_local_var_macports_sources_rsync.macports.org_release_ports_graphics_opencv/opencv/work/OpenCV-2.2.0/modules/core/include/opencv2/core/core.hpp...
:info:build Preprocessing /opt/local/var/macports/build/_opt_local_var_macports_sources_rsync.macports.org_release_ports_graphics_opencv/opencv/work/OpenCV-2.2.0/modules/core/include/opencv2/core/core_c.h...
:info:build Parsing file /opt/local/var/macports/build/_opt_local_var_macports_sources_rsync.macports.org_release_ports_graphics_opencv/opencv/work/OpenCV-2.2.0/modules/core/include/opencv2/core/core_c.h...
:info:build Preprocessing /opt/local/var/macports/build/_opt_local_var_macports_sources_rsync.macports.org_release_ports_graphics_opencv/opencv/work/OpenCV-2.2.0/modules/core/include/opencv2/core/eigen.hpp...
:info:build Parsing file /opt/local/var/macports/build/_opt_local_var_macports_sources_rsync.macports.org_release_ports_graphics_opencv/opencv/work/OpenCV-2.2.0/modules/core/include/opencv2/core/eigen.hpp...
:info:build Preprocessing /opt/local/var/macports/build/_opt_local_var_macports_sources_rsync.macports.org_release_ports_graphics_opencv/opencv/work/OpenCV-2.2.0/modules/core/include/opencv2/core/internal.hpp...
:info:build Parsing file /opt/local/var/macports/build/_opt_local_var_macports_sources_rsync.macports.org_release_ports_graphics_opencv/opencv/work/OpenCV-2.2.0/modules/core/include/opencv2/core/internal.hpp...
:info:build Preprocessing /opt/local/var/macports/build/_opt_local_var_macports_sources_rsync.macports.org_release_ports_graphics_opencv/opencv/work/OpenCV-2.2.0/modules/core/include/opencv2/core/mat.hpp...
:info:build Parsing file /opt/local/var/macports/build/_opt_local_var_macports_sources_rsync.macports.org_release_ports_graphics_opencv/opencv/work/OpenCV-2.2.0/modules/core/include/opencv2/core/mat.hpp...
:info:build Preprocessing /opt/local/var/macports/build/_opt_local_var_macports_sources_rsync.macports.org_release_ports_graphics_opencv/opencv/work/OpenCV-2.2.0/modules/core/include/opencv2/core/operations.hpp...
:info:build Parsing file /opt/local/var/macports/build/_opt_local_var_macports_sources_rsync.macports.org_release_ports_graphics_opencv/opencv/work/OpenCV-2.2.0/modules/core/include/opencv2/core/operations.hpp...
:info:build Preprocessing /opt/local/var/macports/build/_opt_local_var_macports_sources_rsync.macports.org_release_ports_graphics_opencv/opencv/work/OpenCV-2.2.0/modules/core/include/opencv2/core/types_c.h...
:info:build Parsing file /opt/local/var/macports/build/_opt_local_var_macports_sources_rsync.macports.org_release_ports_graphics_opencv/opencv/work/OpenCV-2.2.0/modules/core/include/opencv2/core/types_c.h...
:info:build Preprocessing /opt/local/var/macports/build/_opt_local_var_macports_sources_rsync.macports.org_release_ports_graphics_opencv/opencv/work/OpenCV-2.2.0/modules/core/include/opencv2/core/version.hpp...
:info:build Parsing file /opt/local/var/macports/build/_opt_local_var_macports_sources_rsync.macports.org_release_ports_graphics_opencv/opencv/work/OpenCV-2.2.0/modules/core/include/opencv2/core/version.hpp...
:info:build Preprocessing /opt/local/var/macports/build/_opt_local_var_macports_sources_rsync.macports.org_release_ports_graphics_opencv/opencv/work/OpenCV-2.2.0/modules/core/include/opencv2/core/wimage.hpp...
:info:build Parsing file /opt/local/var/macports/build/_opt_local_var_macports_sources_rsync.macports.org_release_ports_graphics_opencv/opencv/work/OpenCV-2.2.0/modules/core/include/opencv2/core/wimage.hpp...
:info:build Preprocessing /opt/local/var/macports/build/_opt_local_var_macports_sources_rsync.macports.org_release_ports_graphics_opencv/opencv/work/OpenCV-2.2.0/modules/imgproc/include/opencv2/imgproc/imgproc.hpp...
:info:build Parsing file /opt/local/var/macports/build/_opt_local_var_macports_sources_rsync.macports.org_release_ports_graphics_opencv/opencv/work/OpenCV-2.2.0/modules/imgproc/include/opencv2/imgproc/imgproc.hpp...
:info:build Preprocessing /opt/local/var/macports/build/_opt_local_var_macports_sources_rsync.macports.org_release_ports_graphics_opencv/opencv/work/OpenCV-2.2.0/modules/imgproc/include/opencv2/imgproc/imgproc_c.h...
:info:build Parsing file /opt/local/var/macports/build/_opt_local_var_macports_sources_rsync.macports.org_release_ports_graphics_opencv/opencv/work/OpenCV-2.2.0/modules/imgproc/include/opencv2/imgproc/imgproc_c.h...
:info:build Preprocessing /opt/local/var/macports/build/_opt_local_var_macports_sources_rsync.macports.org_release_ports_graphics_opencv/opencv/work/OpenCV-2.2.0/modules/imgproc/include/opencv2/imgproc/types_c.h...
:info:build Parsing file /opt/local/var/macports/build/_opt_local_var_macports_sources_rsync.macports.org_release_ports_graphics_opencv/opencv/work/OpenCV-2.2.0/modules/imgproc/include/opencv2/imgproc/types_c.h...
:info:build Preprocessing /opt/local/var/macports/build/_opt_local_var_macports_sources_rsync.macports.org_release_ports_graphics_opencv/opencv/work/OpenCV-2.2.0/modules/calib3d/include/opencv2/calib3d/calib3d.hpp...
:info:build Parsing file /opt/local/var/macports/build/_opt_local_var_macports_sources_rsync.macports.org_release_ports_graphics_opencv/opencv/work/OpenCV-2.2.0/modules/calib3d/include/opencv2/calib3d/calib3d.hpp...
:info:build Preprocessing /opt/local/var/macports/build/_opt_local_var_macports_sources_rsync.macports.org_release_ports_graphics_opencv/opencv/work/OpenCV-2.2.0/modules/features2d/include/opencv2/features2d/features2d.hpp...
:info:build Parsing file /opt/local/var/macports/build/_opt_local_var_macports_sources_rsync.macports.org_release_ports_graphics_opencv/opencv/work/OpenCV-2.2.0/modules/features2d/include/opencv2/features2d/features2d.hpp...
:info:build Preprocessing /opt/local/var/macports/build/_opt_local_var_macports_sources_rsync.macports.org_release_ports_graphics_opencv/opencv/work/OpenCV-2.2.0/modules/objdetect/include/opencv2/objdetect/objdetect.hpp...
:info:build Parsing file /opt/local/var/macports/build/_opt_local_var_macports_sources_rsync.macports.org_release_ports_graphics_opencv/opencv/work/OpenCV-2.2.0/modules/objdetect/include/opencv2/objdetect/objdetect.hpp...
:info:build Preprocessing /opt/local/var/macports/build/_opt_local_var_macports_sources_rsync.macports.org_release_ports_graphics_opencv/opencv/work/OpenCV-2.2.0/modules/video/include/opencv2/video/background_segm.hpp...
:info:build Parsing file /opt/local/var/macports/build/_opt_local_var_macports_sources_rsync.macports.org_release_ports_graphics_opencv/opencv/work/OpenCV-2.2.0/modules/video/include/opencv2/video/background_segm.hpp...
:info:build Preprocessing /opt/local/var/macports/build/_opt_local_var_macports_sources_rsync.macports.org_release_ports_graphics_opencv/opencv/work/OpenCV-2.2.0/modules/video/include/opencv2/video/tracking.hpp...
:info:build Parsing file /opt/local/var/macports/build/_opt_local_var_macports_sources_rsync.macports.org_release_ports_graphics_opencv/opencv/work/OpenCV-2.2.0/modules/video/include/opencv2/video/tracking.hpp...
:info:build Preprocessing /opt/local/var/macports/build/_opt_local_var_macports_sources_rsync.macports.org_release_ports_graphics_opencv/opencv/work/OpenCV-2.2.0/modules/highgui/include/opencv2/highgui/highgui.hpp...
:info:build Parsing file /opt/local/var/macports/build/_opt_local_var_macports_sources_rsync.macports.org_release_ports_graphics_opencv/opencv/work/OpenCV-2.2.0/modules/highgui/include/opencv2/highgui/highgui.hpp...
:info:build Preprocessing /opt/local/var/macports/build/_opt_local_var_macports_sources_rsync.macports.org_release_ports_graphics_opencv/opencv/work/OpenCV-2.2.0/modules/highgui/include/opencv2/highgui/highgui_c.h...
:info:build Parsing file /opt/local/var/macports/build/_opt_local_var_macports_sources_rsync.macports.org_release_ports_graphics_opencv/opencv/work/OpenCV-2.2.0/modules/highgui/include/opencv2/highgui/highgui_c.h...
:info:build Preprocessing /opt/local/var/macports/build/_opt_local_var_macports_sources_rsync.macports.org_release_ports_graphics_opencv/opencv/work/OpenCV-2.2.0/modules/ml/include/opencv2/ml/ml.hpp...
:info:build Parsing file /opt/local/var/macports/build/_opt_local_var_macports_sources_rsync.macports.org_release_ports_graphics_opencv/opencv/work/OpenCV-2.2.0/modules/ml/include/opencv2/ml/ml.hpp...
:info:build Preprocessing /opt/local/var/macports/build/_opt_local_var_macports_sources_rsync.macports.org_release_ports_graphics_opencv/opencv/work/OpenCV-2.2.0/modules/legacy/include/opencv2/legacy/blobtrack.hpp...
:info:build Parsing file /opt/local/var/macports/build/_opt_local_var_macports_sources_rsync.macports.org_release_ports_graphics_opencv/opencv/work/OpenCV-2.2.0/modules/legacy/include/opencv2/legacy/blobtrack.hpp...
:info:build Preprocessing /opt/local/var/macports/build/_opt_local_var_macports_sources_rsync.macports.org_release_ports_graphics_opencv/opencv/work/OpenCV-2.2.0/modules/legacy/include/opencv2/legacy/compat.hpp...
:info:build Parsing file /opt/local/var/macports/build/_opt_local_var_macports_sources_rsync.macports.org_release_ports_graphics_opencv/opencv/work/OpenCV-2.2.0/modules/legacy/include/opencv2/legacy/compat.hpp...
:info:build Preprocessing /opt/local/var/macports/build/_opt_local_var_macports_sources_rsync.macports.org_release_ports_graphics_opencv/opencv/work/OpenCV-2.2.0/modules/legacy/include/opencv2/legacy/legacy.hpp...
:info:build Parsing file /opt/local/var/macports/build/_opt_local_var_macports_sources_rsync.macports.org_release_ports_graphics_opencv/opencv/work/OpenCV-2.2.0/modules/legacy/include/opencv2/legacy/legacy.hpp...
:info:build Preprocessing /opt/local/var/macports/build/_opt_local_var_macports_sources_rsync.macports.org_release_ports_graphics_opencv/opencv/work/OpenCV-2.2.0/modules/legacy/include/opencv2/legacy/streams.hpp...
:info:build Parsing file /opt/local/var/macports/build/_opt_local_var_macports_sources_rsync.macports.org_release_ports_graphics_opencv/opencv/work/OpenCV-2.2.0/modules/legacy/include/opencv2/legacy/streams.hpp...
:info:build Preprocessing /opt/local/var/macports/build/_opt_local_var_macports_sources_rsync.macports.org_release_ports_graphics_opencv/opencv/work/OpenCV-2.2.0/modules/contrib/include/opencv2/contrib/contrib.hpp...
:info:build Parsing file /opt/local/var/macports/build/_opt_local_var_macports_sources_rsync.macports.org_release_ports_graphics_opencv/opencv/work/OpenCV-2.2.0/modules/contrib/include/opencv2/contrib/contrib.hpp...
:info:build Building group list...
:info:build Building directory list...
:info:build Building namespace list...
:info:build Building file list...
:info:build Building class list...
:info:build Associating documentation with classes...
:info:build Computing nesting relations for classes...
:info:build Building example list...
:info:build Searching for enumerations...
:info:build Searching for documented typedefs...
:info:build Searching for members imported via using declarations...
:info:build Searching for included using directives...
:info:build Searching for documented variables...
:info:build Building member list...
:info:build Searching for friends...
:info:build Searching for documented defines...
:info:build Computing class inheritance relations...
:info:build Computing class usage relations...
:info:build Flushing cached template relations that have become invalid...
:info:build Creating members for template instances...
:info:build Computing class relations...
:info:build Add enum values to enums...
:info:build Searching for member function documentation...
:info:build Building page list...
:info:build Search for main page...
:info:build Computing page relations...
:info:build Determining the scope of groups...
:info:build Sorting lists...
:info:build Freeing entry tree
:info:build Determining which enums are documented
:info:build Computing member relations...
:info:build Building full member lists recursively...
:info:build Adding members to member groups.
:info:build Computing member references...
:info:build Inheriting documentation...
:info:build Generating disk names...
:info:build Adding source references...
:info:build Adding xrefitems...
:info:build Sorting member lists...
:info:build Resolving citations...
:info:build Generating citations page...
:info:build Counting data structures...
:info:build Resolving user defined references...
:info:build Finding anchors and sections in the documentation...
:info:build Combining using relations...
:info:build Adding members to index pages...
:info:build Generating style sheet...
:info:build Generating search indices...
:info:build Generating index page...
:info:build Generating page index...
:info:build Generating example documentation...
:info:build Generating file sources...
:info:build Generating code for file /opt/local/var/macports/build/_opt_local_var_macports_sources_rsync.macports.org_release_ports_graphics_opencv/opencv/work/OpenCV-2.2.0/modules/calib3d/include/opencv2/calib3d/calib3d.hpp...
:info:build Generating code for file /opt/local/var/macports/build/_opt_local_var_macports_sources_rsync.macports.org_release_ports_graphics_opencv/opencv/work/OpenCV-2.2.0/modules/contrib/include/opencv2/contrib/contrib.hpp...
:info:build Generating code for file /opt/local/var/macports/build/_opt_local_var_macports_sources_rsync.macports.org_release_ports_graphics_opencv/opencv/work/OpenCV-2.2.0/modules/core/include/opencv2/core/core.hpp...
:info:build Generating code for file /opt/local/var/macports/build/_opt_local_var_macports_sources_rsync.macports.org_release_ports_graphics_opencv/opencv/work/OpenCV-2.2.0/modules/core/include/opencv2/core/core_c.h...
:info:build Generating code for file /opt/local/var/macports/build/_opt_local_var_macports_sources_rsync.macports.org_release_ports_graphics_opencv/opencv/work/OpenCV-2.2.0/modules/core/include/opencv2/core/eigen.hpp...
:info:build Generating code for file /opt/local/var/macports/build/_opt_local_var_macports_sources_rsync.macports.org_release_ports_graphics_opencv/opencv/work/OpenCV-2.2.0/modules/core/include/opencv2/core/internal.hpp...
:info:build Generating code for file /opt/local/var/macports/build/_opt_local_var_macports_sources_rsync.macports.org_release_ports_graphics_opencv/opencv/work/OpenCV-2.2.0/modules/core/include/opencv2/core/mat.hpp...
:info:build Generating code for file /opt/local/var/macports/build/_opt_local_var_macports_sources_rsync.macports.org_release_ports_graphics_opencv/opencv/work/OpenCV-2.2.0/modules/core/include/opencv2/core/operations.hpp...
:info:build Generating code for file /opt/local/var/macports/build/_opt_local_var_macports_sources_rsync.macports.org_release_ports_graphics_opencv/opencv/work/OpenCV-2.2.0/modules/core/include/opencv2/core/types_c.h...
:info:build Generating code for file /opt/local/var/macports/build/_opt_local_var_macports_sources_rsync.macports.org_release_ports_graphics_opencv/opencv/work/OpenCV-2.2.0/modules/imgproc/include/opencv2/imgproc/types_c.h...
:info:build Generating code for file /opt/local/var/macports/build/_o/opt/local/var/macports/build/_opt_local_var_macports_sources_rsync.macports.org_release_ports_graphics_opencv/opencv/work/OpenCV-2.2.0/modules/core/include/opencv2/core/core.hpp:2011: warning: Unsupported xml/html tag <cmpop> found
:info:build /opt/local/var/macports/build/_opt_local_var_macports_sources_rsync.macports.org_release_ports_graphics_opencv/opencv/work/OpenCV-2.2.0/modules/core/include/opencv2/core/core.hpp:2013: warning: Unsupported xml/html tag <cmpop> found
:info:build pt_local_var_macports_sources_rsync.macports.org_release_ports_graphics_opencv/opencv/work/OpenCV-2.2.0/modules/core/include/opencv2/core/version.hpp...
:info:build Generating code for file /opt/local/var/macports/build/_opt_local_var_macports_sources_rsync.macports.org_release_ports_graphics_opencv/opencv/work/OpenCV-2.2.0/modules/core/include/opencv2/core/wimage.hpp...
:info:build Generating code for file /opt/local/var/macports/build/_opt_local_var_macports_sources_rsync.macports.org_release_ports_graphics_opencv/opencv/work/OpenCV-2.2.0/modules/features2d/include/opencv2/features2d/features2d.hpp...
:info:build Generating code for file /opt/local/var/macports/build/_opt_local_var_macports_sources_rsync.macports.org_release_ports_graphics_opencv/opencv/work/OpenCV-2.2.0/modules/highgui/include/opencv2/highgui/highgui.hpp...
:info:build Generating code for file /opt/local/var/macports/build/_opt_local_var_macports_sources_rsync.macports.org_release_ports_graphics_opencv/opencv/work/OpenCV-2.2.0/modules/highgui/include/opencv2/highgui/highgui_c.h...
:info:build Generating code for file /opt/local/var/macports/build/_opt_local_var_macports_sources_rsync.macports.org_release_ports_graphics_opencv/opencv/work/OpenCV-2.2.0/modules/imgproc/include/opencv2/imgproc/imgproc.hpp...
:info:build Generating code for file /opt/local/var/macports/build/_opt_local_var_macports_sources_rsync.macports.org_release_ports_graphics_opencv/opencv/work/OpenCV-2.2.0/modules/imgproc/include/opencv2/imgproc/imgproc_c.h...
:info:build Generating code for file /opt/local/var/macports/build/_opt_local_var_macports_sources_rsync.macports.org_release_ports_graphics_opencv/opencv/work/OpenCV-2.2.0/modules/legacy/include/opencv2/legacy/blobtrack.hpp...
:info:build Generating code for file /opt/local/var/macports/build/_opt_local_var_macports_sources_rsync.macports.org_release_ports_graphics_opencv/opencv/work/OpenCV-2.2.0/modules/legacy/include/opencv2/legacy/compat.hpp...
:info:build Generating code for file /opt/local/var/macports/build/_opt_local_var_macports_sources_rsync.macports.org_release_ports_graphics_opencv/opencv/work/OpenCV-2.2.0/modules/legacy/include/opencv2/legacy/legacy.hpp...
:info:build Generating code for file /opt/local/var/macports/build/_opt_local_var_macports_sources_rsync.macports.org_release_ports_graphics_opencv/opencv/work/OpenCV-2.2.0/modules/legacy/include/opencv2/legacy/streams.hpp...
:info:build Generating code for file /opt/local/var/macports/build/_opt_local_var_macports_sources_rsync.macports.org_release_ports_graphics_opencv/opencv/work/OpenCV-2.2.0/modules/ml/include/opencv2/ml/ml.hpp...
:info:build Generating code for file /opt/local/var/macports/build/_opt_local_var_macports_sources_rsync.macports.org_release_ports_graphics_opencv/opencv/work/OpenCV-2.2.0/modules/objdetect/include/opencv2/objdetect/objdetect.hpp...
:info:build Generating code for file /opt/local/var/macports/build/_opt_local_var_macports_sources_rsync.macports.org_release_ports_graphics_opencv/opencv/work/OpenCV-2.2.0/modules/video/include/opencv2/video/background_segm.hpp...
:info:build Generating code for file /opt/local/var/macports/build/_opt_local_var_macports_sources_rsync.macports.org_release_ports_graphics_opencv/opencv/work/OpenCV-2.2.0/modules/video/include/opencv2/video/tracking.hpp...
:info:build Generating file documentation...
:info:build Generating docs for file /opt/local/var/macports/build/_opt_local_var_macports_sources_rsync.macports.org_release_ports_graphics_opencv/opencv/work/OpenCV-2.2.0/modules/calib3d/include/opencv2/calib3d/calib3d.hpp...
:info:build Generating docs for file /opt/local/var/macports/build/_opt_local_var_macports_sources_rsync.macports.org_release_ports_graphics_opencv/opencv/work/OpenCV-2.2.0/modules/contrib/include/opencv2/contrib/contrib.hpp...
:info:build Generating docs for file /opt/local/var/macports/build/_opt_local_var_macports_sources_rsync.macports.org_release_ports_graphics_opencv/opencv/work/OpenCV-2.2.0/modules/core/include/opencv2/core/core.hpp...
:info:build Generating docs for file /opt/local/var/macports/build/_opt_local_var_macports_sources_rsync.macports.org_release_ports_graphics_opencv/opencv/work/OpenCV-2.2.0/modules/core/include/opencv2/core/core_c.h...
:info:build Generating docs for file /opt/local/var/macports/build/_opt_local_var_macports_sources_rsync.macports.org_release_ports_graphics_opencv/opencv/work/OpenCV-2.2.0/modules/core/include/opencv2/core/eigen.hpp...
:info:build Generating docs for file /opt/local/var/macports/build/_opt_local_var_macports_sources_rsync.macports.org_release_ports_graphics_opencv/opencv/work/OpenCV-2.2.0/modules/core/include/opencv2/core/internal.hpp...
:info:build Generating docs for file /opt/local/var/macports/build/_opt_local_var_macports_sources_rsync.macports.org_release_ports_graphics_opencv/opencv/work/OpenCV-2.2.0/modules/core/include/opencv2/core/mat.hpp...
:info:build Generating docs for file /opt/local/var/macports/build/_opt_local_var_macports_sources_rsync.macports.org_release_ports_graphics_opencv/opencv/work/OpenCV-2.2.0/modules/core/include/opencv2/core/operations.hpp...
:info:build Generating docs for file /opt/local/var/macports/build/_opt_local_var_macports_sources_rsync.macports.org_release_ports_graphics_opencv/opencv/work/OpenCV-2.2.0/modules/core/include/opencv2/core/types_c.h...
:info:build Generating docs for file /opt/local/var/macports/build/_opt_local_var_macports_sources_rsync.macports.org_release_ports_graphics_opencv/opencv/work/OpenCV-2.2.0/modules/imgproc/include/opencv2/imgproc/types_c.h...
:info:build Generating docs for file /opt/local/var/macports/build/_opt_local_var_macports_sources_rsync.macports.org_release_ports_graphics_opencv/opencv/work/OpenCV-2.2.0/modules/core/include/opencv2/core/version.hpp...
:info:build Generating docs for file /opt/local/var/macports/build/_opt_local_var_macports_sources_rsync.macports.org_release_ports_graphics_opencv/opencv/work/OpenCV-2.2.0/modules/core/include/opencv2/core/wimage.hpp...
:info:build Generating docs for file /opt/local/var/macports/build/_opt_local_var_macports_sources_rsync.macports.org_release_ports_graphics_opencv/opencv/work/OpenCV-2.2.0/modules/features2d/include/opencv2/features2d/features2d.hpp...
:info:build Generating docs for file /opt/local/var/macports/build/_opt_local_var_macports_sources_rsync.macports.org_release_ports_graphics_opencv/opencv/work/OpenCV-2.2.0/modules/highgui/include/opencv2/highgui/highgui.hpp...
:info:build Generating docs for file /opt/local/var/macports/build/_opt_local_var_macports_sources_rsync.macports.org_release_ports_graphics_opencv/opencv/work/OpenCV-2.2.0/modules/highgui/include/opencv2/highgui/highgui_c.h...
:info:build Generating docs for file /opt/local/var/macports/build/_opt_local_var_macports_sources_rsync.macports.org_release_ports_graphics_opencv/opencv/work/OpenCV-2.2.0/modules/imgproc/include/opencv2/imgproc/imgproc.hpp...
:info:build Generating docs for file /opt/local/var/macports/build/_opt_local_var_macports_sources_rsync.macports.org_release_ports_graphics_opencv/opencv/work/OpenCV-2.2.0/modules/imgproc/include/opencv2/imgproc/imgproc_c.h...
:info:build Generating docs for file /opt/local/var/macports/build/_opt_local_var_macports_sources_rsync.macports.org_release_ports_graphics_opencv/opencv/work/OpenCV-2.2.0/modules/legacy/include/opencv2/legacy/blobtrack.hpp...
:info:build Generating docs for file /opt/local/var/macports/build/_opt_local_var_macports_sources_rsync.macports.org_release_ports_graphics_opencv/opencv/work/OpenCV-2.2.0/modules/legacy/include/opencv2/legacy/compat.hpp...
:info:build Generating docs for file /opt/local/var/macports/build/_opt_local_var_macports_sources_rsync.macports.org_release_ports_graphics_opencv/opencv/work/OpenCV-2.2.0/modules/legacy/include/opencv2/legacy/legacy.hpp...
:info:build Generating docs for file /opt/local/var/macports/build/_opt_local_var_macports_sources_rsync.macports.org_release_ports_graphics_opencv/opencv/work/OpenCV-2.2.0/modules/legacy/include/opencv2/legacy/streams.hpp...
:info:build Generating docs for file /opt/local/var/macports/build/_opt_local_var_macports_sources_rsync.macports.org_release_ports_graphics_opencv/opencv/work/OpenCV-2.2.0/modules/ml/include/opencv2/ml/ml.hpp...
:info:build Generating docs for file /opt/local/var/macports/build/_opt_local_var_macports_sources_rsync.macports.org_release_ports_graphics_opencv/opencv/work/OpenCV-2.2.0/modules/objdetect/include/opencv2/objdetect/objdetect.hpp...
:info:build Generating docs for file /opt/local/var/macports/build/_opt_local_var_macports_sources_rsync.macports.org_release_ports_graphics_opencv/opencv/work/OpenCV-2.2.0/modules/video/include/opencv2/video/background_segm.hpp...
:info:build Generating docs for file /opt/local/var/macports/build/_opt_local_var_macports_sources_rsync.macports.org_release_ports_graphics_opencv/opencv/work/OpenCV-2.2.0/modules/video/include/opencv2/video/tracking.hpp...
:info:build Generating page documentation...
:info:build Generating docs for page todo...
:info:build Generating group documentation...
:info:build Generating group index...
:info:build Generating class documentation...
:info:build Generating annotated compound index...
:info:build Generating alphabetical compound index...
:info:build Generating hierarchical class index...
:info:build Generating member index...
:info:build Generating docs for compound _CvPixelPosition32f...
:info:build Generating docs for compound _CvPixelPosition8s...
:info:build Generating docs for compound _CvPixelPosition8u...
:info:build Generating docs for compound _IplConvKernel...
:info:build Generating docs for compound _IplConvKernelFP...
:info:build Generating docs for compound _IplImage...
:info:build Generating docs for compound _IplROI...
:info:build Generating docs for compound Cv32suf...
:info:build Generating docs for compound Cv3dTracker2dTrackedObject...
:info:build Generating docs for compound Cv3dTrackerCameraInfo...
:info:build Generating docs for compound Cv3dTrackerCameraIntrinsics...
:info:build Generating docs for compound Cv3dTrackerTrackedObject...
:info:build Generating docs for compound Cv64suf...
:info:build Generating docs for compound CvAdaptiveSkinDetector...
:info:build Generating docs for compound CvANN_MLP...
:info:build Generating docs for compound CvANN_MLP_TrainParams...
:info:build Generating docs for compound CvAttrList...
:info:build Generating docs for compound CvAvgComp...
:info:build Generating docs for compound CvBGCodeBookElem...
:info:build Generating docs for compound CvBGCodeBookModel...
:info:build Generating docs for compound CvBGPixelCCStatTable...
:info:build Generating docs for compound CvBGPixelCStatTable...
:info:build Generating docs for compound CvBGPixelStat...
:info:build Generating docs for compound CvBGStatModel...
:info:build Generating docs for compound CvBigFuncTable...
:info:build Generating docs for compound CvBlob...
:info:build Generating docs for compound CvBlobDetector...
:info:build Generating docs for compound CvBlobSeq...
:info:build Generating docs for compound CvBlobTrack...
:info:build Generating docs for compound CvBlobTrackAnalysis...
:info:build Generating docs for compound CvBlobTrackAnalysisHeight...
:info:build Generating docs for compound CvBlobTrackAnalysisOne...
:info:build Generating docs for compound CvBlobTracker...
:info:build Generating docs for compound CvBlobTrackerAuto...
:info:build Generating docs for compound CvBlobTrackerAutoParam1...
:info:build Generating docs for compound CvBlobTrackerOne...
:info:build Generating docs for compound CvBlobTrackerParamLH...
:info:build Generating docs for compound CvBlobTrackerParamMS...
:info:build Generating docs for compound CvBlobTrackFVGen...
:info:build Generating docs for compound CvBlobTrackGen...
:info:build Generating docs for compound CvBlobTrackPostProc...
:info:build Generating docs for compound CvBlobTrackPostProcOne...
:info:build Generating docs for compound CvBlobTrackPredictor...
:info:build Generating docs for compound CvBlobTrackSeq...
:info:build Generating docs for compound CvBoost...
:info:build Generating docs for compound CvBoostParams...
:info:build Generating docs for compound CvBoostTree...
:info:build Generating docs for compound CvBox2D...
:info:build Generating docs for compound CvCalibFilter...
:info:build Generating docs for compound CvCamera...
:info:build Generating docs for compound CvCamShiftTracker...
:info:build Generating docs for compound CvChain...
:info:build Generating docs for compound CvChainPtReader...
:info:build Generating docs for compound CvCliqueFinder...
:info:build Generating docs for compound CvConDensation...
:info:build Generating docs for compound CvConnectedComp...
:info:build Generating docs for compound CvContour...
:info:build Generating docs for compound CvContourOrientation...
:info:build Generating docs for compound CvContourTree...
:info:build Generating docs for compound CvConvexityDefect...
:info:build Generating docs for compound CvDefParam...
:info:build Generating docs for compound CvDetectedBlob...
:info:build Generating docs for compound CvDrawShape...
:info:build Generating docs for compound CvDTree...
:info:build Generating docs for compound CvDTreeNode...
:info:build Generating docs for compound CvDTreeParams...
:info:build Generating docs for compound CvDTreeSplit...
:info:build Generating docs for compound CvDTreeTrainData...
:info:build Generating docs for compound CvEHMM...
:info:build Generating docs for compound CvEHMMState...
:info:build Generating docs for compound CvEM...
:info:build Generating docs for compound CvEMParams...
:info:build Generating docs for compound CvERTrees...
:info:build Generating docs for compound CvERTreeTrainData...
:info:build Generating docs for compound CvFace...
:info:build Generating docs for compound CvFGDetector...
:info:build Generating docs for compound CvFGDStatModel...
:info:build Generating docs for compound CvFGDStatModelParams...
:info:build Generating docs for compound CvFileNode...
:info:build Generating docs for compound CvFont...
:info:build Generating docs for compound CvForestERTree...
:info:build Generating docs for compound CvForestTree...
:info:build Generating docs for compound CvFuncTable...
:info:build Generating docs for compound CvFuzzyController...
:info:build Generating docs for compound CvFuzzyCurve...
:info:build Generating docs for compound CvFuzzyFunction...
:info:build Generating docs for compound CvFuzzyMeanShiftTracker...
:info:build Generating docs for compound CvFuzzyPoint...
:info:build Generating docs for compound CvFuzzyRule...
:info:build Generating docs for compound CvGaussBGModel...
:info:build Generating docs for compound CvGaussBGPoint...
:info:build Generating docs for compound CvGaussBGStatModelParams...
:info:build Generating docs for compound CvGaussBGValues...
:info:build Generating docs for compound CvGBTrees...
:info:build Generating docs for compound CvGBTreesParams...
:info:build Generating docs for compound CvGraph...
:info:build Generating docs for compound CvGraphEdge...
:info:build Generating docs for compound CvGraphScanner...
:info:build Generating docs for compound CvGraphVtx...
:info:build Generating docs for compound CvGraphVtx2D...
:info:build Generating docs for compound CvGraphWeightedEdge...
:info:build Generating docs for compound CvGraphWeightedVtx...
:info:build Generating docs for compound CvHaarClassifier...
:info:build Generating docs for compound CvHaarClassifierCascade...
:info:build Generating docs for compound CvHaarFeature...
:info:build Generating docs for compound CvHaarStageClassifier...
:info:build Generating docs for compound CvHistogram...
:info:build Generating docs for compound CvHuMoments...
:info:build Generating docs for compound CvImage...
:info:build Generating docs for compound CvImageDrawer...
:info:build Generating docs for compound CvImgObsInfo...
:info:build Generating docs for compound CvInput...
:info:build Generating docs for compound CvKalman...
:info:build Generating docs for compound CvKNearest...
:info:build Generating docs for compound CvLatentSvmDetector...
:info:build Generating docs for compound CvLCMEdge...
:info:build Generating docs for compound CvLCMNode...
:info:build Generating docs for compound CvLevMarq...
:info:build Generating docs for compound CvLineIterator...
:info:build Generating docs for compound CvLSHOperations...
:info:build Generating docs for compound CvLSVMFilterObject...
:info:build Generating docs for compound CvLSVMFilterPosition...
:info:build Generating docs for compound CvMat...
:info:build Generating docs for compound CvMatND...
:info:build Generating docs for compound CvMatrix...
:info:build Generating docs for compound CvMatrix3...
:info:build Generating docs for compound CvMemBlock...
:info:build Generating docs for compound CvMemStorage...
:info:build Generating docs for compound CvMemStoragePos...
:info:build Generating docs for compound CvMLData...
:info:build Generating docs for compound CvModule...
:info:build Generating docs for compound CvModuleInfo...
:info:build Generating docs for compound CvMoments...
:info:build Generating docs for compound CvMSERParams...
:info:build Generating docs for compound CvNArrayIterator...
:info:build Generating docs for compound CvNormalBayesClassifier...
:info:build Generating docs for compound CvObjectDetection...
:info:build Generating docs for compound CvObjectDetector...
:info:build Generating docs for compound CvPair16u32s...
:info:build Generating docs for compound CvParamGrid...
:info:build Generating docs for compound CvPluginFuncInfo...
:info:build Generating docs for compound CvPoint...
:info:build Generating docs for compound CvPoint2D32f...
:info:build Generating docs for compound CvPoint2D64f...
:info:build Generating docs for compound CvPoint3D32f...
:info:build Generating docs for compound CvPoint3D64f...
:info:build Generating docs for compound CvProb...
:info:build Generating docs for compound CvQuadEdge2D...
:info:build Generating docs for compound CvRandState...
:info:build Generating docs for compound CvRect...
:info:build Generating docs for compound CvRTParams...
:info:build Generating docs for compound CvRTrees...
:info:build Generating docs for compound CvScalar...
:info:build Generating docs for compound CvSeq...
:info:build Generating docs for compound CvSeqBlock...
:info:build Generating docs for compound CvSeqReader...
:info:build Generating docs for compound CvSeqWriter...
:info:build Generating docs for compound CvSet...
:info:build Generating docs for compound CvSetElem...
:info:build Generating docs for compound CvSize...
:info:build Generating docs for compound CvSize2D32f...
:info:build Generating docs for compound CvSlice...
:info:build Generating docs for compound CvSparseMat...
:info:build Generating docs for compound CvSparseMa/opt/local/var/macports/build/_opt_local_var_macports_sources_rsync.macports.org_release_ports_graphics_opencv/opencv/work/OpenCV-2.2.0/modules/core/include/opencv2/core/core.hpp:2011: warning: Unsupported xml/html tag <cmpop> found
:info:build /opt/local/var/macports/build/_opt_local_var_macports_sources_rsync.macports.org_release_ports_graphics_opencv/opencv/work/OpenCV-2.2.0/modules/core/include/opencv2/core/core.hpp:2013: warning: Unsupported xml/html tag <cmpop> found
:info:build /opt/local/var/macports/build/_opt_local_var_macports_sources_rsync.macports.org_release_ports_graphics_opencv/opencv/work/OpenCV-2.2.0/modules/core/include/opencv2/core/core.hpp:2011: warning: Unsupported xml/html tag <cmpop> found
:info:build /opt/local/var/macports/build/_opt_local_var_macports_sources_rsync.macports.org_release_ports_graphics_opencv/opencv/work/OpenCV-2.2.0/modules/core/include/opencv2/core/core.hpp:2013: warning: Unsupported xml/html tag <cmpop> found
:info:build /opt/local/var/macports/build/_opt_local_var_macports_sources_rsync.macports.org_release_ports_graphics_opencv/opencv/work/OpenCV-2.2.0/modules/video/include/opencv2/video/tracking.hpp:272: warning: Found unknown command `\url'
:info:build /opt/local/var/macports/build/_opt_local_var_macports_sources_rsync.macports.org_release_ports_graphics_opencv/opencv/work/OpenCV-2.2.0/modules/core/include/opencv2/core/core.hpp:1726: warning: image file roi.png is not found in IMAGE_PATH: assuming external image.
:info:build /opt/local/var/macports/build/_opt_local_var_macports_sources_rsync.macports.org_release_ports_graphics_opencv/opencv/work/OpenCV-2.2.0/modules/core/include/opencv2/core/core.hpp:3077: warning: argument 'try1d' of command @param is not found in the argument list of cv::SparseMat::SparseMat(const Mat &m)
:info:build /opt/local/var/macports/build/_opt_local_var_macports_sources_rsync.macports.org_release_ports_graphics_opencv/opencv/work/OpenCV-2.2.0/modules/core/include/opencv2/core/core.hpp:3103: warning: The following parameters of cv::SparseMat::convertTo(Mat &m, int rtype, double alpha=1, double beta=0) const are not documented:
:info:build   parameter 'm'
:info:build tIterator...
:info:build Generating docs for compound CvSparseNode...
:info:build Generating docs for compound CvStarDetectorParams...
:info:build Generating docs for compound CvStarKeypoint...
:info:build Generating docs for compound CvStatModel...
:info:build Generating docs for compound CvStereoBMState...
:info:build Generating docs for compound CvStereoCamera...
:info:build Generating docs for compound CvStereoGCState...
:info:build Generating docs for compound CvStereoLineCoeff...
:info:build Generating docs for compound CvString...
:info:build Generating docs for compound CvStringHashNode...
:info:build Generating docs for compound CvSubdiv2D...
:info:build Generating docs for compound CvSubdiv2DPoint...
:info:build Generating docs for compound CvSURFParams...
:info:build Generating docs for compound CvSURFPoint...
:info:build Generating docs for compound CvSVM...
:info:build Generating docs for compound CvSVMDecisionFunc...
:info:build Generating docs for compound CvSVMKernel...
:info:build Generating docs for compound CvSVMKernelRow...
:info:build Generating docs for compound CvSVMParams...
:info:build Generating docs for compound CvSVMSolutionInfo...
:info:build Generating docs for compound CvSVMSolver...
:info:build Generating docs for compound CvTermCriteria...
:info:build Generating docs for compound CvTracksTimePos...
:info:build Generating docs for compound CvTrainTestSplit...
:info:build Generating docs for compound CvTreeNodeIterator...
:info:build Generating docs for compound CvType...
:info:build Generating docs for compound CvTypeInfo...
:info:build Generating docs for compound CvVectors...
:info:build Generating docs for compound CvVoronoiDiagram2D...
:info:build Generating docs for compound CvVoronoiEdge2D...
:info:build Generating docs for compound CvVoronoiNode2D...
:info:build Generating docs for compound CvVoronoiSite2D...
:info:build Generating docs for compound CvVSModule...
:info:build Generating docs for compound lsh_hash...
:info:build Generating namespace index...
:info:build Generating docs for namespace cv
:info:build Generating docs for compound cv::Accumulator...
:info:build Generating docs for compound cv::Accumulator< char >...
:info:build Generating docs for compound cv::Accumulator< short >...
:info:build Generating docs for compound cv::Accumulator< unsigned char >...
:info:build Generating docs for compound cv::Accumulator< unsigned short >...
:info:build Generating docs for compound cv::AdjusterAdapter...
:info:build Generating docs for compound cv::Allocator...
:info:build Generating docs for nested compound cv::Allocator::rebind...
:info:build Generating docs for compound cv::AutoBuffer...
:info:build Generating docs for compound cv::BackgroundSubtractor...
:info:build Generating docs for compound cv::BackgroundSubtractorMOG...
:info:build Generating docs for compound cv::BaseColumnFilter...
:info:build Generating docs for compound cv::BaseFilter...
:info:build Generating docs for compound cv::BaseKeypoint...
:info:build Generating docs for compound cv::BaseRowFilter...
:info:build Generating docs for compound cv::BlockedRange...
:info:build Generating docs for compound cv::BOWImgDescriptorExtractor...
:info:build Generating docs for compound cv::BOWKMeansTrainer...
:info:build Generating docs for compound cv::BOWTrainer...
:info:build Generating docs for compound cv::BriefDescriptorExtractor...
:info:build Generating docs for compound cv::BruteForceMatcher...
:info:build Generating docs for compound cv::CalonderDescriptorExtractor...
:info:build Generating docs for compound cv::CascadeClassifier...
:info:build Generating docs for nested compound cv::CascadeClassifier::DTree...
:info:build Generating docs for nested compound cv::CascadeClassifier::DTreeNode...
:info:build Generating docs for nested compound cv::CascadeClassifier::Stage...
:info:build Generating docs for compound cv::Complex...
:info:build Generating docs for compound cv::CvAffinePose...
:info:build Generating docs for compound cv::DataDepth...
:info:build Generating docs for compound cv::DataDepth< _Tp * >...
:info:build Generating docs for compound cv::DataDepth< bool >...
:info:build Generating docs for compound cv::DataDepth< char >...
:info:build Generating docs for compound cv::DataDepth< double >...
:info:build Generating docs for compound cv::DataDepth< float >...
:info:build Generating docs for compound cv::DataDepth< int >...
:info:build Generating docs for compound cv::DataDepth< schar >...
:info:build Generating docs for compound cv::DataDepth< short >...
:info:build Generating docs for compound cv::DataDepth< uchar >...
:info:build Generating docs for compound cv::DataDepth< unsigned >...
:info:build Generating docs for compound cv::DataDepth< ushort >...
:info:build Generating docs for compound cv::DataType...
:info:build Generating docs for compound cv::DataType< bool >...
:info:build Generating docs for compound cv::DataType< char >...
:info:build Generating docs for compound cv::DataType< Complex< _Tp > >...
:info:build Generating docs for compound cv::DataType< double >...
:info:build Generating docs for compound cv::DataType< float >...
:info:build Generating docs for compound cv::DataType< int >...
:info:build Generating docs for compound cv::DataType< Point3_< _Tp > >...
:info:build Generating docs for compound cv::DataType< Point_< _Tp > >...
:info:build Generating docs for compound cv::DataType< Range >...
:info:build Generating docs for compound cv::DataType< Rect_< _Tp > >...
:info:build Generating docs for compound cv::DataType< Scalar_< _Tp > >...
:info:build Generating docs for compound cv::DataType< schar >...
:info:build Generating docs for compound cv::DataType< short >...
:info:build Generating docs for compound cv::DataType< Size_< _Tp > >...
:info:build Generating docs for compound cv::DataType< std::complex< _Tp > >...
:info:build Generating docs for compound cv::DataType< uchar >...
:info:build Generating docs for compound cv::DataType< ushort >...
:info:build Generating docs for compound cv::DataType< Vec< _Tp, cn > >...
:info:build Generating docs for compound cv::DefaultRngAuto...
:info:build Generating docs for compound cv::DenseFeatureDetector...
:info:build Generating docs for nested compound cv::DenseFeatureDetector::Params...
:info:build Generating docs for compound cv::DescriptorExtractor...
:info:build Generating docs for compound cv::DescriptorMatcher...
:info:build Generating docs for nested compound cv::DescriptorMatcher::DescriptorCollection...
:info:build Generating docs for compound cv::DMatch...
:info:build Generating docs for compound cv::DrawMatchesFlags...
:info:build Generating docs for compound cv::DynamicAdaptedFeatureDetector...
:info:build Generating docs for compound cv::Exception...
:info:build Generating docs for compound cv::FastAdjuster...
:info:build Generating docs for compound cv::FastFeatureDetector...
:info:build Generating docs for compound cv::FeatureDetector...
:info:build Generating docs for compound cv::FeatureEvaluator...
:info:build Generating docs for compound cv::FernClassifier...
:info:build Generating docs for nested compound cv::FernClassifier::Feature...
:info:build Generating docs for compound cv::FernDescriptorMatcher...
:info:build Generating docs for nested compound cv::FernDescriptorMatcher::Params...
:info:build Generating docs for compound cv::FileNode...
:info:build Generating docs for compound cv::FileNodeIterator...
:info:build Generating docs for compound cv::FileStorage...
:info:build Generating docs for compound cv::FilterEngine...
:info:build Generating docs for compound cv::FlannBasedMatcher...
:info:build Generating docs for compound cv::Formatted...
:info:build Generating docs for compound cv::Formatter...
:info:build Generating docs for compound cv::GenericDescriptorMatcher...
:info:build Generating docs for nested compound cv::GenericDescriptorMatcher::KeyPointCollection...
:info:build Generating docs for compound cv::GoodFeaturesToTrackDetector...
:info:build Generating docs for nested compound cv::GoodFeaturesToTrackDetector::Params...
:info:build Generating docs for compound cv::GreaterEq...
:info:build Generating docs for compound cv::GreaterEqIdx...
:info:build Generating docs for compound cv::GridAdaptedFeatureDetector...
:info:build Generating docs for compound cv::Hamming...
:info:build Generating docs for compound cv::HammingLUT...
:info:build Generating docs for compound cv::HOGDescriptor...
:info:build Generating docs for compound cv::KalmanFilter...
:info:build Generating docs for compound cv::KDTree...
:info:build Generating docs for nested compound cv::KDTree::Node...
:info:build Generating docs for compound cv::KeyPoint...
:info:build Generating docs for compound cv::L1...
:info:build Generating docs for compound cv::L2...
:info:build Generating docs for compound cv::LDetector...
:info:build Generating docs for compound cv::LessThan...
:info:build Generating docs for compound cv::LessThanIdx...
:info:build Generating docs for compound cv::LevMarqSparse...
:info:build Generating docs for compound cv::LineIterator...
:info:build Generating docs for compound cv::Mat...
:info:build Generating docs for nested compound cv::Mat::MSize...
:info:build Generating docs for nested compound cv::Mat::MStep...
:info:build Generating docs for compound cv::Mat_...
:info:build Generating docs for compound cv::MatAllocator...
:info:build Generating docs for compound cv::MatCommaInitializer_...
:info:build Generating docs for compound cv::MatConstIterator...
:info:build Generating docs for compound cv::MatConstIterator_...
:info:build Generating docs for compound cv::MatExpr...
:info:build Generating docs for compound cv::MatIterator_...
:info:build Generating docs for compound cv::MatOp...
:info:build Generating docs for compound cv::Matx...
:info:build Generating docs for compound cv::Matx_AddOp...
:info:build Generating docs for compound cv::Matx_DetOp...
:info:build Generating docs for compound cv::Matx_DetOp< _Tp, 1 >...
:info:build Generating docs for compound cv::Matx_DetOp< _Tp, 2 >...
:info:build Generating docs for compound cv::Matx_DetOp< _Tp, 3 >...
:info:build Generating docs for compound cv::Matx_FastInvOp...
:info:build Generating docs for compound cv::Matx_FastInvOp< _Tp, 2 >...
:info:build Generating docs for compound cv::Matx_FastInvOp< _Tp, 3 >...
:info:build Generating docs for compound cv::Matx_FastSolveOp...
:info:build Generating docs for compound cv::Matx_FastSolveOp< _Tp, 2, 1 >...
:info:build Generating docs for compound cv::Matx_FastSolveOp< _Tp, 3, 1 >...
:info:build Generating docs for compound cv::Matx_MatMulOp...
:info:build Generating docs for compound cv::Matx_MulOp...
:info:build Generating docs for compound cv::Matx_ScaleOp...
:info:build Generating docs for compound cv::Matx_SubOp...
:info:build Generating docs for compound cv::Matx_TOp...
:info:build Generating docs for compound cv::MatxCommaInitializer...
:info:build Generating docs for compound cv::Mesh3D...
:info:build Generating docs for nested compound cv::Mesh3D::EmptyMeshException...
:info:build Generating docs for compound cv::Moments...
:info:build Generating docs for compound cv::MSER...
:info:build Generating docs for compound cv::MserFeatureDetector...
:info:build Generating docs for compound cv::NAryMatIterator...
:info:build Generating docs for compound cv::Octree...
:info:build Generating docs for nested compound cv::Octree::Node...
:info:build Generating docs for compound cv::OneWayDescriptor...
:info:build Generating docs for compound cv::OneWayDescriptorBase...
:info:build Generating docs for compound cv::OneWayDescriptorMatcher...
:info:build Generating docs for nested compound cv::OneWayDescriptorMatcher::Params...
:info:build Generating docs for compound cv::OneWayDescriptorObject...
:info:build Generating docs for compound cv::OpponentColorDescriptorExtractor...
:info:build Generating docs for compound cv::PatchGenerator...
:info:build Generating docs for compound cv::PCA...
:info:build Generating docs for compound cv::PlanarObjectDetector...
:info:build Generating docs for compound cv::Point3_...
:info:build Generating docs for compound cv::Point_...
:info:build Generating docs for compound cv::Ptr...
:info:build Generating docs for compound cv::PyramidAdaptedFeatureDetector...
:info:build Generating docs for compound cv::RandomizedTree...
:info:build Generating docs for compound cv::Range...
:info:build Generating docs for compound cv::Rect_...
:info:build Generating docs for compound cv::RNG...
:info:build Generating docs for compound cv::RotatedRect...
:info:build Generating docs for compound cv::RTreeClassifier...
:info:build Generating docs for compound cv::RTreeNode...
:info:build Generating docs for compound cv::RTTIImpl...
:info:build Generating docs for compound cv::Scalar_...
:info:build Generating docs for compound cv::SelfSimDescriptor...
:info:build Generating docs for compound cv::Seq...
:info:build Generating docs for compound cv::SeqIterator...
:info:build Generating docs for compound cv::SIFT...
:info:build Generating docs for nested compound cv::SIFT::CommonParams...
:info:build Generating docs for nested compound cv::SIFT::DescriptorParams...
:info:build Generating docs for nested compound cv::SIFT::DetectorParams...
:info:build Generating docs for compound cv::SiftDescriptorExtractor...
:info:build Generating docs for compound cv::SiftFeatureDetector...
:info:build Generating docs for compound cv::Size_...
:info:build Generating docs for compound cv::SparseMat...
:info:build Generating docs for nested compound cv::SparseMat::Hdr...
:info:build Generating docs for nested compound cv::SparseMat::Node...
:info:build Generating docs for compound cv::SparseMat_...
:info:build Generating docs for compound cv::SparseMatConstIterator...
:info:build Generating docs for compound cv::SparseMatConstIterator_...
:info:build Generating docs for compound cv::SparseMatIterator...
:info:build Generating docs for compound cv::SparseMatIterator_...
:info:build Generating docs for compound cv::SpinImageModel...
:info:build Generating docs for compound cv::Split...
:info:build Generating docs for compound cv::StarAdjuster...
:info:build Generating docs for compound cv::StarDetector...
:info:build Generating docs for compound cv::StarFeatureDetector...
:info:build Generating docs for compound cv::StereoBM...
:info:build Generating docs for compound cv::StereoSGBM...
:info:build Generating docs for compound cv::SURF...
:info:build Generating docs for compound cv::SurfAdjuster...
:info:build Generating docs for compound cv::SurfDescriptorExtractor...
:info:build Generating docs for compound cv::SurfFeatureDetector...
:info:build Generating docs for compound cv::SVD...
:info:build Generating docs for compound cv::TermCriteria...
:info:build Generating docs for compound cv::TickMeter...
:info:build Generating docs for compound cv::Vec...
:info:build Generating docs for compound cv::VecCommaInitializer...
:info:build Generating docs for compound cv::VecReaderProxy...
:info:build Generating docs for compound cv::VecReaderProxy< _Tp, 1 >...
:info:build Generating docs for compound cv::Vector...
:info:build Generating docs for nested compound cv::Vector::Hdr...
:info:build Generating docs for compound cv::VectorDescriptorMatcher...
:info:build Generating docs for compound cv::VecWriterProxy...
:info:build Generating docs for compound cv::VecWriterProxy< _Tp, 1 >...
:info:build Generating docs for compound cv::VideoCapture...
:info:build Generating docs for compound cv::VideoWriter...
:info:build Generating docs for compound cv::WImage...
:info:build Generating docs for compound cv::WImageBuffer...
:info:build Generating docs for compound cv::WImageBufferC...
:info:build Generating docs for compound cv::WImageC...
:info:build Generating docs for compound cv::WImageView...
:info:build Generating docs for compound cv::WImageViewC...
:info:build Generating docs for compound cv::WriteStructContext...
:info:build Generating namespace member index...
:info:build Generating graph info page...
:info:build Generating file index...
:info:build Generating example index...
:info:build Generating file member index...
:info:build finalizing index lists...
:info:build finished...
:info:build make[2]: Leaving directory `/opt/local/var/macports/build/_opt_local_var_macports_sources_rsync.macports.org_release_ports_graphics_opencv/opencv/work/OpenCV-2.2.0'
:info:build /opt/local/bin/cmake -E cmake_progress_report /opt/local/var/macports/build/_opt_local_var_macports_sources_rsync.macports.org_release_ports_graphics_opencv/opencv/work/OpenCV-2.2.0/CMakeFiles 
:info:build [ 62%] Built target DOXY_HTML
:info:build make[1]: Leaving directory `/opt/local/var/macports/build/_opt_local_var_macports_sources_rsync.macports.org_release_ports_graphics_opencv/opencv/work/OpenCV-2.2.0'
:info:build make: *** [all] Error 2
:info:build make: Leaving directory `/opt/local/var/macports/build/_opt_local_var_macports_sources_rsync.macports.org_release_ports_graphics_opencv/opencv/work/OpenCV-2.2.0'
:info:build shell command " cd "/opt/local/var/macports/build/_opt_local_var_macports_sources_rsync.macports.org_release_ports_graphics_opencv/opencv/work/OpenCV-2.2.0" && /usr/bin/make -j2 -w all " returned error 2
:error:build Target org.macports.build returned: shell command failed (see log for details)
:debug:build Backtrace: shell command failed (see log for details)
    while executing
"command_exec build"
    (procedure "portbuild::build_main" line 8)
    invoked from within
"$procedure $targetname"
:info:build Warning: the following items did not execute (for opencv): org.macports.install org.macports.build org.macports.destroot
:notice:build Log for opencv is at: /opt/local/var/macports/logs/_opt_local_var_macports_sources_rsync.macports.org_release_ports_graphics_opencv/opencv/main.log

#34016 opencv: error: ‘nppiAbsDiff_8u_C4R’ was not declared in this scope macports-tickets@… defect Normal ports

Reported by ezlokazov@…, 3 years ago.

Description

Trying to install opencv

$ sudo port install opencv

Building opencv fails with the message:

Error: Target org.macports.build returned: shell command failed (see log for details)

cleaning opencv and reinstall do not help. Log attached

#34106 opencv: error: ‘nppiAbsDiff_8u_C4R’ was not declared in this scope macports-tickets@… defect Normal ports

Reported by edoardo16@…, 3 years ago.

Description

Opencv-2.3.1 build error on MacOS X 10.7.3 with Xcode 4.3.2 and CUDA driver 4.2.7:

:info:build /opt/local/var/macports/build/_opt_local_var_macports_sources_rsync.macports.org_release_tarballs_ports_graphics_opencv/opencv/work/OpenCV-2.3.1/modules/gpu/src/element_operations.cpp: In function ‘void cv::gpu::absdiff(const cv::gpu::GpuMat&, const cv::gpu::GpuMat&, cv::gpu::GpuMat&, cv::gpu::Stream&)’:
:info:build /opt/local/var/macports/build/_opt_local_var_macports_sources_rsync.macports.org_release_tarballs_ports_graphics_opencv/opencv/work/OpenCV-2.3.1/modules/gpu/src/element_operations.cpp:298: error: ‘nppiAbsDiff_8u_C4R’ was not declared in this scope
:info:build /opt/local/var/macports/build/_opt_local_var_macports_sources_rsync.macports.org_release_tarballs_ports_graphics_opencv/opencv/work/OpenCV-2.3.1/modules/gpu/src/element_operations.cpp:302: error: ‘nppiAbsDiff_32s_C1R’ was not declared in this scope
:info:build /opt/local/var/macports/build/_opt_local_var_macports_sources_rsync.macports.org_release_tarballs_ports_graphics_opencv/opencv/work/OpenCV-2.3.1/modules/gpu/src/graphcuts.cpp: In function ‘void cv::gpu::graphcut(cv::gpu::GpuMat&, cv::gpu::GpuMat&, cv::gpu::GpuMat&, cv::gpu::GpuMat&, cv::gpu::GpuMat&, cv::gpu::GpuMat&, cv::gpu::GpuMat&, cv::gpu::Stream&)’:
:info:build /opt/local/var/macports/build/_opt_local_var_macports_sources_rsync.macports.org_release_tarballs_ports_graphics_opencv/opencv/work/OpenCV-2.3.1/modules/gpu/src/graphcuts.cpp:80: error: cannot convert ‘unsigned char*’ to ‘NppiGraphcutState*’ for argument ‘11’ to ‘NppStatus nppiGraphcut_32s8u(Npp32s*, Npp32s*, Npp32s*, Npp32s*, Npp32s*, int, int, NppiSize, Npp8u*, int, NppiGraphcutState*)’
:info:build make[2]: *** [modules/gpu/CMakeFiles/opencv_gpu.dir/src/graphcuts.o] Error 1
#24245 opencv installation fail stante@… defect Normal ports

Reported by johnny.boldt@…, 5 years ago.

Description

Hi. I installed opencv. It worked but i wanted to re-install it and had MANY problems. Here's where i'm at.

sudo port install -d opencv
--->  Computing dependencies for opencv
--->  Building opencv
Error: Target org.macports.build returned: shell command " cd "/opt/local/var/macports/build/_opt_local_var_macports_sources_rsync.macports.org_release_ports_graphics_opencv/work/OpenCV-2.0.0" && /usr/bin/make -j1 all " returned error 2
Command output: highgui/cvcap_qt.cpp:518: warning: 'GetPixRowBytes' is deprecated (declared at /System/Library/Frameworks/ApplicationServices.framework/Frameworks/QD.framework/Headers/QDOffscreen.h:376)
highgui/cvcap_qt.cpp:524: warning: 'UnlockPixels' is deprecated (declared at /System/Library/Frameworks/ApplicationServices.framework/Frameworks/QD.framework/Headers/QDOffscreen.h:196)
highgui/cvcap_qt.cpp:524: warning: 'UnlockPixels' is deprecated (declared at /System/Library/Frameworks/ApplicationServices.framework/Frameworks/QD.framework/Headers/QDOffscreen.h:196)
highgui/cvcap_qt.cpp: In function 'int icvOpenCamera_QT(CvCapture_QT_Cam*, int)':
highgui/cvcap_qt.cpp:981: warning: 'DisposeGWorld' is deprecated (declared at /System/Library/Frameworks/ApplicationServices.framework/Frameworks/QD.framework/Headers/QDOffscreen.h:226)
highgui/cvcap_qt.cpp:981: warning: 'DisposeGWorld' is deprecated (declared at /System/Library/Frameworks/ApplicationServices.framework/Frameworks/QD.framework/Headers/QDOffscreen.h:226)
highgui/cvcap_qt.cpp:996: warning: 'GetGWorldPixMap' is deprecated (declared at /System/Library/Frameworks/ApplicationServices.framework/Frameworks/QD.framework/Headers/QDOffscreen.h:480)
highgui/cvcap_qt.cpp:996: warning: 'GetGWorldPixMap' is deprecated (declared at /System/Library/Frameworks/ApplicationServices.framework/Frameworks/QD.framework/Headers/QDOffscreen.h:480)
highgui/cvcap_qt.cpp:998: warning: 'LockPixels' is deprecated (declared at /System/Library/Frameworks/ApplicationServices.framework/Frameworks/QD.framework/Headers/QDOffscreen.h:184)
highgui/cvcap_qt.cpp:998: warning: 'LockPixels' is deprecated (declared at /System/Library/Frameworks/ApplicationServices.framework/Frameworks/QD.framework/Headers/QDOffscreen.h:184)
highgui/cvcap_qt.cpp:999: warning: 'GetPixBaseAddr' is deprecated (declared at /System/Library/Frameworks/ApplicationServices.framework/Frameworks/QD.framework/Headers/QDOffscreen.h:364)
highgui/cvcap_qt.cpp:999: warning: 'GetPixBaseAddr' is deprecated (declared at /System/Library/Frameworks/ApplicationServices.framework/Frameworks/QD.framework/Headers/QDOffscreen.h:364)
highgui/cvcap_qt.cpp:999: warning: 'GetPixRowBytes' is deprecated (declared at /System/Library/Frameworks/ApplicationServices.framework/Frameworks/QD.framework/Headers/QDOffscreen.h:376)
highgui/cvcap_qt.cpp:999: warning: 'GetPixRowBytes' is deprecated (declared at /System/Library/Frameworks/ApplicationServices.framework/Frameworks/QD.framework/Headers/QDOffscreen.h:376)
highgui/cvcap_qt.cpp: In function 'int icvClose_QT_Cam(CvCapture_QT_Cam*)':
highgui/cvcap_qt.cpp:1039: warning: 'DisposeGWorld' is deprecated (declared at /System/Library/Frameworks/ApplicationServices.framework/Frameworks/QD.framework/Headers/QDOffscreen.h:226)
highgui/cvcap_qt.cpp:1039: warning: 'DisposeGWorld' is deprecated (declared at /System/Library/Frameworks/ApplicationServices.framework/Frameworks/QD.framework/Headers/QDOffscreen.h:226)
mv -f .deps/lib_highgui_la-cvcap_qt.Tpo .deps/lib_highgui_la-cvcap_qt.Plo
/bin/sh ../libtool  --tag=CXX   --mode=compile /usr/bin/g++-4.0 -DHAVE_CONFIG_H -I. -I..  -DNDEBUG  -I../include/opencv -I/opt/local/include -fast -g  -O2 -arch i386 -MT lib_highgui_la-window_carbon.lo -MD -MP -MF .deps/lib_highgui_la-window_carbon.Tpo -c -o lib_highgui_la-window_carbon.lo `test -f 'highgui/window_carbon.cpp' || echo './'`highgui/window_carbon.cpp
libtool: compile:  /usr/bin/g++-4.0 -DHAVE_CONFIG_H -I. -I.. -DNDEBUG -I../include/opencv -I/opt/local/include -fast -g -O2 -arch i386 -MT lib_highgui_la-window_carbon.lo -MD -MP -MF .deps/lib_highgui_la-window_carbon.Tpo -c highgui/window_carbon.cpp  -fno-common -DPIC -o .libs/lib_highgui_la-window_carbon.o
mv -f .deps/lib_highgui_la-window_carbon.Tpo .deps/lib_highgui_la-window_carbon.Plo
/bin/sh ../libtool  --tag=CXX   --mode=compile /usr/bin/g++-4.0 -DHAVE_CONFIG_H -I. -I..  -DNDEBUG  -I../include/opencv -I/opt/local/include -fast -g  -O2 -arch i386 -MT lib_highgui_la-grfmt_imageio.lo -MD -MP -MF .deps/lib_highgui_la-grfmt_imageio.Tpo -c -o lib_highgui_la-grfmt_imageio.lo `test -f 'highgui/grfmt_imageio.cpp' || echo './'`highgui/grfmt_imageio.cpp
libtool: compile:  /usr/bin/g++-4.0 -DHAVE_CONFIG_H -I. -I.. -DNDEBUG -I../include/opencv -I/opt/local/include -fast -g -O2 -arch i386 -MT lib_highgui_la-grfmt_imageio.lo -MD -MP -MF .deps/lib_highgui_la-grfmt_imageio.Tpo -c highgui/grfmt_imageio.cpp  -fno-common -DPIC -o .libs/lib_highgui_la-grfmt_imageio.o
highgui/grfmt_imageio.cpp: In member function 'virtual bool cv::ImageIODecoder::readData(cv::Mat&)':
highgui/grfmt_imageio.cpp:116: error: 'kCGColorSpaceGenericRGBLinear' was not declared in this scope
highgui/grfmt_imageio.cpp: In member function 'virtual bool cv::ImageIOEncoder::write(const cv::Mat&, const std::vector<int, std::allocator<int> >&)':
highgui/grfmt_imageio.cpp:278: error: 'kCGColorSpaceGenericRGBLinear' was not declared in this scope
make[2]: *** [lib_highgui_la-grfmt_imageio.lo] Error 1
make[1]: *** [all-recursive] Error 1
make: *** [all] Error 2
#32094 opencv: ld: duplicate symbol std::tr1::placeholders::(anonymous namespace)::_10 raphael@… defect Normal ports

Reported by trog24@…, 3 years ago.

Description

I started out with the same cannot be built error:

Error: opencv 2.3.1a cannot be built while opencv 2.2.0 is installed and active.
Error: Please deactivate opencv 2.2.0 first.
Error: Target org.macports.build returned: incompatible opencv version active
Log for opencv is at: /opt/local/var/macports/logs/_opt_local_var_macports_sources_rsync.macports.org_release_ports_graphics_opencv/opencv/main.log
Error: Unable to upgrade port: 1
To report a bug, see <http://guide.macports.org/#project.tickets>

I then deactivated opencv and continued the upgrade of outdated. Opencv did not update.

I then tried sudo port install opencv and got the following error:

Error: Target org.macports.build returned: shell command failed (see log for details)
Log for opencv is at: /opt/local/var/macports/logs/_opt_local_var_macports_sources_rsync.macports.org_release_ports_graphics_opencv/opencv/main.log
Error: Status 1 encountered during processing.
To report a bug, see <http://guide.macports.org/#project.tickets>

I thought that it remnants remained from the previous attempt and did the following: sudo port clean opencv

Before reattempting the install, I thought that it may be better if I uninstalled opencv.

I then made another attempt at installing and got the following error:

--->  Computing dependencies for opencv
--->  Fetching archive for opencv
--->  Attempting to fetch opencv-2.3.1a_1.darwin_9.ppc.tgz from http://packages.macports.org/opencv
--->  Fetching opencv
--->  Verifying checksum(s) for opencv
--->  Extracting opencv
--->  Applying patches to opencv
--->  Configuring opencv
--->  Building opencv
Error: Target org.macports.build returned: shell command failed (see log for details)
Log for opencv is at: /opt/local/var/macports/logs/_opt_local_var_macports_sources_rsync.macports.org_release_ports_graphics_opencv/opencv/main.log
Error: Status 1 encountered during processing.
To report a bug, see <http://guide.macports.org/#project.tickets>

Attached is the log file from the failure. Please note that this is the PowerPC version.

#33098 opencv: ld: duplicate symbol std::tr1::placeholders::(anonymous namespace)::_10 macports-tickets@… defect Normal ports

Reported by o.schmalz@…, 3 years ago.

Description

I cannot build the opencv, I need it for digikam. Mac OS X 10.5, OpenCV 2.3.1a

Error: Target org.macports.build returned: shell command failed (see log for details)
Error: Failed to install opencv
Log for opencv is at: /opt/local/var/macports/logs/_opt_local_var_macports_sources_rsync.macports.org_release_tarballs_ports_graphics_opencv/opencv/main.log
Error: The following dependencies were not installed: opencv
Error: Status 1 encountered during processing.

Log attached, please help me! I need your help very much! :)

#27800 opencv+libdc1394 breaks iSight FireWire camera compatibility; no qt4 support. stante@… defect Normal ports

Reported by njbutko@…, 4 years ago.

Description

By default, macports opencv2.2 tries to install and link to libdc1394, which makes old iSight cameras not work. There is no variant to turn libdc1394 off.

Also, there are no variants to enable the new qt4 backend for graphical interfaces.

I am attaching a patch with two improvements:

  1. libdc1394 variant makes libdc1394 support opt-in.
  2. qt4 variant enables qt4 backend for graphical interface.
#31817 opencv: non-const static data member must be initialized out of line macports-tickets@… defect Normal ports

Reported by shankga@…, 3 years ago.

Description

When building opencv I get an error that the following items are failing to execute:

  • org.macports.activate
  • org.macports.build
  • org.macports.destroot
  • org.macports.install

I have already tried cleaning the port (twice). This is after doing a fresh new install of macports and having never installed macports before.

Attached is the log.

#28332 OpenCV Portfile - Add missing reinplace for python27 variant stante@… enhancement Normal ports

Reported by nucleus_rei@…, 4 years ago.

Description

Hi,

It seems a reinplace statement is missing for variant python27 because it clearly is needed for the equal python26 variant.

I took the liberty of adding the missing bit. I will include a unified patch.

André

#29633 opencv port installs python .so in wrong location macports-tickets@… defect Normal ports

Reported by stefan.walk@…, 4 years ago.

Description

I installed opencv with the +python27 variant, but it installs the python module in a directory named /opt/local/@@PYTHON_PKGD@@ (i guess a replacement went wrong).

It can be fixed by

/opt/local> sudo cp @@PYTHON_PKGD@@/cv.so Library/Frameworks/Python.framework/Versions/2.7/lib/python2.7/site-packages/

but it's confusing at first.

#33307 opencv+python27 fails to install if numpy is not installed macports-tickets@… defect Normal ports

Reported by paul.bombach@…, 3 years ago.

Description

OpenCV+python27 silently fails to completely install if numpy is not installed before hand. I expected it to check for a numpy dependency and install numpy if necessary.

#16447 OpenCV : Python bindings fail to load stante@… defect Normal ports

Reported by ajb78@…, 7 years ago.

Description

After installing opencv when I try to import the python bindings it fails with:

Fatal Python error: Interpreter not initialized (version mismatch?)

This seems to indicate that the wrong python library is being loaded, however, when I use otool -L to check which library all the dylib's and so's are linked to they seem to be to the macports framework (as they should be since I used python_select to properly select the version of python i'm using).

#12978 OpenCV updated ryandesign@… update Normal ports

Reported by miyasita@…, 7 years ago.

Description

I have updated Portfile of OpenCV port from 0.9.9 to 1.0.0. Only the version number and MD5 checksum are updated and I have successfully compiled it by "port install opencv" on my MacBook. Here is a patch: http://www.miyaken.org/~miyasita/tmp/OpenCV.Portfile.patch

#31818 opencv: update to 2.3.1a macports-tickets@… update Normal ports

Reported by ryandesign@…, 3 years ago.

Description

opencv should be updated to the latest version, currently 2.3.1. I have been working on this update; I'll attach my patch.

#29967 OpenCV upgrade to 2.2.0_1 fails with ffmpeg-devel macports-tickets@… defect Normal ports

Reported by dersh@…, 4 years ago.

Description

I have opencv 2.2.0_0 installed. There was an upgrade to 2.2.0_1 but it fails for me.

Here is the error:

--->  Building opencv
Error: Target org.macports.build returned: shell command failed (see log for details)
Log for opencv is at: /opt/local/var/macports/logs/_opt_local_var_macports_sources_rsync.macports.org_release_ports_graphics_opencv/main.log
Error: Unable to upgrade port: 1
To report a bug, see <http://guide.macports.org/#project.tickets>

I am also attaching the log file.

#35512 OpenCV variant: OpenNI stromnov@… enhancement Normal ports

Reported by orgicus@…, 3 years ago.

Description

Hello,

I was recently recently updating OpenCV and noticed there was no OpenNI variant. The majority of OpenCV developers might not use the OpenNI support, so it doesn't make sense that this option is on by default, but for developers using a sensor such as Kinect/Xtion Pro/etc. this would be very useful.

It would be awesome if there would be an openni variant next to the existing OpenCV ones.

Thank you, George

P.S. This is as recommended in this thread: http://old.nabble.com/OpenCV-port-variants-td34239708.html P.S. I'm not experienced with MacPorts and not sure if adding OpenNI support also means adding an OpenNI port or not.

#47256 OpenCV variants are not getting installed stromnov@… defect Normal ports

Reported by animesh.lovelyworld@…, 7 days ago.

Description

Installation of opencv works perfectly fins. However when any variant is being installed (+tbb or +opencl), the installation fails. The main.log shows the reason of this failure:

The source directory "/opt/local/var/macports/build/_opt_local_var_macports_sources_rsync.macports.org_release_tarballs_ports_graphics_opencv/opencv/work/build" does not appear to contain CMakeLists.txt.

#47264 OpenCV Won't Build on Yosemite macports-tickets@… defect Normal ports

Reported by ddmarshall@…, 6 days ago.

Description

On a fresh install of macports on Yosemite using xcode 6.2 get the following error message during configuration:

:info:configure CMake Error: The source directory "/opt/local/var/macports/build/_opt_local_var_macports_sources_rsync.macports.org_release_tarballs_ports_graphics_opencv/opencv/work/build" does not appear to contain CMakeLists.txt.

Is this related to ticket #47197?

#35104 Opendkim version bump (was fix for opendkim crashing on darwin 9) pixilla@… enhancement Normal ports

Reported by dluke@…, 3 years ago.

Description

I've been running opendkim (2.6.2) outside of MacPorts on a Darwin 9 (ppc) box.

It appears that the resolver on darwin9 isn't thread safe, so opendkim crashes a lot (and even manages to kernel panic the machine).

I've got a simple patch to configure.ac that fixes it there. I'm not sure about the thread safety of the resolver on later darwin releases, though (this might be needed for more recent OS releases as well).

#31858 opendx @4.4.4 Build Failure: error: first parameter of 'main' (argument count) must be of type 'int' gwright@… defect Normal ports

Reported by abigail.l.bull@…, 3 years ago.

Description

I have a macbook pro running Lion. I am trying to install OpenDx. After running

sudo port install opendx

The install crashes with the following message

--->  Computing dependencies for opendx
--->  Building opendx
Error: Target org.macports.build returned: shell command failed (see log for details)
Log for opendx is at: /opt/local/var/macports/logs/_opt_local_var_macports_sources_rsync.macports.org_release_tarballs_ports_science_opendx/opendx/main.log
Error: Status 1 encountered during processing.
To report a bug, see <http://guide.macports.org/#project.tickets>

I have done a clean, sync, update, etc., and still have the same issue. Any ideas?

#15381 opendx-4.4.4 depends on OpenMotif but should be openmotif gwright@… defect Normal ports

Reported by blb@…, 7 years ago.

Description

science/opendx depends on port:OpenMotif but should be port:openmotif.

#31871 Opendx 4.4.4 Error when running on Mac OSX macports-tickets@… defect Normal ports

Reported by abigail.l.bull@…, 3 years ago.

Description

I seem to have successfully installed Opendx using <<< sudo port clean opendx sudo port install opendx configure.compiler=llvm-gcc-4.2

However, when I run the program, lots of error windows open up with the message <<< Format Error (1) encountered in packet >>>

The program freezes and nothing else happens. I have to force close the program. Is this to do with the port installation?

#45933 opendx autoreconf failure macports-tickets@… defect Normal ports

Reported by mschamschula@…, 4 months ago.

Description

Under Yosemite (and likely Mavericks with Xcode 6.1) opendx fails the autoreconf stage, as automake lacks the --add-missing argument. This issue is fixed by adding -i to autoreconf.args.

#23928 opendx autoreconf failure: error: m4_require: circular dependency of AC_LANG_COMPILER(C++) gwright@… defect Normal ports

Reported by morasta@…, 5 years ago.

Description

I've tried installing OpenDX on MacPorts 1.8.2 using the following command:

sudo port install opendx

Things happen, it appears to be working fine, then I get the following (when passed through -d):

--->  Extracting dx-4.4.4.tar.gz
DEBUG: setting option extract.args to /opt/local/var/macports/distfiles/opendx/dx-4.4.4.tar.gz
DEBUG: Environment: MACOSX_DEPLOYMENT_TARGET='10.6'
DEBUG: Assembled command: 'cd "/opt/local/var/macports/build/_opt_local_var_macports_sources_rsync.macports.org_release_ports_science_opendx/work" && /usr/bin/gzip -dc /opt/local/var/macports/distfiles/opendx/dx-4.4.4.tar.gz | /usr/bin/gnutar --no-same-owner -xf -'
DEBUG: Executing org.macports.patch (opendx)
--->  Configuring opendx
DEBUG: Using compiler 'Mac OS X gcc 4.2'
DEBUG: Executing org.macports.configure (opendx)
DEBUG: Environment: MACOSX_DEPLOYMENT_TARGET='10.6'
DEBUG: Assembled command: 'cd "/opt/local/var/macports/build/_opt_local_var_macports_sources_rsync.macports.org_release_ports_science_opendx/work/dx-4.4.4" && autoreconf --install -fv'
autoreconf: Entering directory `.'
autoreconf: configure.ac: not using Gettext
autoreconf: running: aclocal --force 
configure.ac:222: error: m4_require: circular dependency of AC_LANG_COMPILER(C++)
../../lib/autoconf/lang.m4:316: AC_LANG_COMPILER_REQUIRE is expanded from...
../../lib/autoconf/general.m4:2645: AC_LINK_IFELSE is expanded from...
/opt/local/share/aclocal/libtool.m4:1022: _LT_SYS_MODULE_PATH_AIX is expanded from...
/opt/local/share/aclocal/libtool.m4:5340: _LT_LANG_CXX_CONFIG is expanded from...
/opt/local/share/aclocal/libtool.m4:785: _LT_LANG is expanded from...
/opt/local/share/aclocal/libtool.m4:768: LT_LANG is expanded from...
../../lib/autoconf/c.m4:667: AC_LANG_COMPILER(C++) is expanded from...
../../lib/autoconf/lang.m4:316: AC_LANG_COMPILER_REQUIRE is expanded from...
../../lib/autoconf/general.m4:2573: AC_COMPILE_IFELSE is expanded from...
../../lib/m4sugar/m4sh.m4:598: AS_IF is expanded from...
../../lib/m4sugar/m4sh.m4:346: AS_REQUIRE is expanded from...
../../lib/autoconf/general.m4:183: AC_REQUIRE_SHELL_FN is expanded from...
../../lib/autoconf/headers.m4:129: _AC_CHECK_HEADER_MONGREL is expanded from...
../../lib/autoconf/headers.m4:67: AC_CHECK_HEADER is expanded from...
../../lib/m4sugar/m4sh.m4:566: AS_FOR is expanded from...
../../lib/autoconf/headers.m4:249: AC_CHECK_HEADERS is expanded from...
configure.ac:222: the top level
autom4te: /opt/local/bin/gm4 failed with exit status: 1
aclocal: /opt/local/bin/autom4te failed with exit status: 1
autoreconf: aclocal failed with exit status: 1
Error: Target org.macports.configure returned: autoreconf failure: shell command " cd "/opt/local/var/macports/build/_opt_local_var_macports_sources_rsync.macports.org_release_ports_science_opendx/work/dx-4.4.4" && autoreconf --install -fv " returned error 1
DEBUG: Backtrace: autoreconf failure: shell command " cd "/opt/local/var/macports/build/_opt_local_var_macports_sources_rsync.macports.org_release_ports_science_opendx/work/dx-4.4.4" && autoreconf --install -fv " returned error 1
    while executing
"$procedure $targetname"
Warning: the following items did not execute (for opendx): org.macports.activate org.macports.configure org.macports.build org.macports.destroot org.macports.install
Error: Status 1 encountered during processing.
To report a bug, see <http://guide.macports.org/#project.tickets>

Tried checking what I could tell was happening from that and I couldn't determine what the problem was exactly. A search of older tickets likewise turned nothing up.

#14975 opendx build on leopard fails with unresolved symbols gwright@… defect Normal ports

Reported by pel1@…, 7 years ago.

Description

I am trying to build opendx on an intel mac pro running leopard. All the dependencies build without problem, but opendx itself fails with a large number of unresolved symbols referenced in libOPENGL.a Logfile attached.

#14085 opendx compilation problem on Leopard and newer gwright@… defect Normal ports

Reported by joergf@…, 7 years ago.

Description

When trying to install the opendx port on Leopard I ran into several compilation issues. There are several problems and I am trying to figure out how to patch the Portfile.

Currently, I am stuck with the following message:

kepler:base> make
g++ -DHAVE_CONFIG_H -I. -I. -I../../../include -I./../widgets -I../../../include -Dmacos  -I/opt/local/include  -I/usr/X11R6/include  -g -O2 -I/usr/X11R6/include -c -o StartWebBrowser.o StartWebBrowser.C
/System/Library/Frameworks/Security.framework/Headers/cssmconfig.h:48: error: declaration does not declare anything
/System/Library/Frameworks/Security.framework/Headers/cssmconfig.h:64: error: multiple types in one declaration
/System/Library/Frameworks/Security.framework/Headers/cssmconfig.h:64: error: declaration does not declare anything
/System/Library/Frameworks/Security.framework/Headers/cssmconfig.h:68: error: declaration does not declare anything
/System/Library/Frameworks/Security.framework/Headers/cssmconfig.h:72: error: multiple types in one declaration
/System/Library/Frameworks/Security.framework/Headers/cssmconfig.h:72: error: declaration does not declare anything
make: *** [StartWebBrowser.o] Error 1

This seems to be a problem with the header files on Leopard. It appears in other projects outside macports, too. I do not see what to make of it and how to avoid it. There seem to be two incompatible definitions for various types floating around. Would anyone know what to do?

#19564 opendx configure failure gwright@… defect Normal ports

Reported by macsforever2000@…, 6 years ago.

Description

I see the following error while trying to configure opendx. I'm on Mac OS X 10.5.6. Xcode 3.1.2.

--->  Configuring opendx
Error: Target org.macports.configure returned: autoconf failure: shell command " cd "/opt/local/var/macports/build/_opt_local_var_macports_sources_svn.macports.org_trunk_dports_science_opendx/work/dx-4.4.4" && autoreconf -fvi " returned error 1
Command output: autoreconf: Entering directory `.'
autoreconf: configure.ac: not using Gettext
autoreconf: running: aclocal --force 
/opt/local/share/aclocal/imlib.m4:9: warning: underquoted definition of AM_PATH_IMLIB
/opt/local/share/aclocal/imlib.m4:9:   run info '(automake)Extending aclocal'
/opt/local/share/aclocal/imlib.m4:9:   or see http://sources.redhat.com/automake/automake.html#Extending-aclocal
configure.ac:222: error: m4_require: circular dependency of AC_LANG_COMPILER(C++)
../../lib/autoconf/lang.m4:271: AC_LANG_COMPILER_REQUIRE is expanded from...
../../lib/autoconf/general.m4:2518: AC_LINK_IFELSE is expanded from...
/opt/local/share/aclocal/libtool.m4:1022: _LT_SYS_MODULE_PATH_AIX is expanded from...
/opt/local/share/aclocal/libtool.m4:5340: _LT_LANG_CXX_CONFIG is expanded from...
/opt/local/share/aclocal/libtool.m4:785: _LT_LANG is expanded from...
/opt/local/share/aclocal/libtool.m4:768: LT_LANG is expanded from...
../../lib/autoconf/c.m4:769: AC_LANG_COMPILER(C++) is expanded from...
../../lib/autoconf/lang.m4:271: AC_LANG_COMPILER_REQUIRE is expanded from...
../../lib/autoconf/general.m4:2462: AC_COMPILE_IFELSE is expanded from...
../../lib/m4sugar/m4sh.m4:505: AS_IF is expanded from...
../../lib/autoconf/headers.m4:87: AC_CHECK_HEADER is expanded from...
../../lib/autoconf/headers.m4:195: AC_CHECK_HEADERS is expanded from...
configure.ac:222: the top level
autom4te: /opt/local/bin/gm4 failed with exit status: 1
aclocal: autom4te failed with exit status: 1
autoreconf: aclocal failed with exit status: 1

Error: Unable to upgrade port: 1
#25706 opendx does not compile gwright@… defect Normal ports

Reported by ralf@…, 5 years ago.

Description
ralf@rmacpro:~/workspace/mrtl/scripts/mrtl> sudo port -v install opendx
Password:
--->  Computing dependencies for opendx.
--->  Configuring opendx
autoreconf: Entering directory `.'
autoreconf: configure.ac: not using Gettext
autoreconf: running: aclocal --force 
configure.ac:222: error: m4_require: circular dependency of AC_LANG_COMPILER(C++)
../../lib/autoconf/lang.m4:316: AC_LANG_COMPILER_REQUIRE is expanded from...
../../lib/autoconf/general.m4:2645: AC_LINK_IFELSE is expanded from...
/opt/local/share/aclocal/libtool.m4:1084: _LT_SYS_MODULE_PATH_AIX is expanded from...
/opt/local/share/aclocal/libtool.m4:5424: _LT_LANG_CXX_CONFIG is expanded from...
/opt/local/share/aclocal/libtool.m4:816: _LT_LANG is expanded from...
/opt/local/share/aclocal/libtool.m4:799: LT_LANG is expanded from...
../../lib/autoconf/c.m4:667: AC_LANG_COMPILER(C++) is expanded from...
../../lib/autoconf/lang.m4:316: AC_LANG_COMPILER_REQUIRE is expanded from...
../../lib/autoconf/general.m4:2573: AC_COMPILE_IFELSE is expanded from...
../../lib/m4sugar/m4sh.m4:598: AS_IF is expanded from...
../../lib/m4sugar/m4sh.m4:346: AS_REQUIRE is expanded from...
../../lib/autoconf/general.m4:183: AC_REQUIRE_SHELL_FN is expanded from...
../../lib/autoconf/headers.m4:129: _AC_CHECK_HEADER_MONGREL is expanded from...
../../lib/autoconf/headers.m4:67: AC_CHECK_HEADER is expanded from...
../../lib/m4sugar/m4sh.m4:566: AS_FOR is expanded from...
../../lib/autoconf/headers.m4:249: AC_CHECK_HEADERS is expanded from...
configure.ac:222: the top level
autom4te: /opt/local/bin/gm4 failed with exit status: 1
aclocal: /opt/local/bin/autom4te failed with exit status: 1
autoreconf: aclocal failed with exit status: 1
shell command " cd "/opt/local/var/macports/build/_opt_local_var_macports_sources_rsync.macports.org_release_ports_science_opendx/work/dx-4.4.4" && autoreconf --install -fv " returned error 1
Error: Target org.macports.configure returned: autoreconf failure: shell command failed
Warning: the following items did not execute (for opendx): org.macports.activate org.macports.configure org.macports.build org.macports.destroot org.macports.install
Log for opendx is at: /opt/local/var/macports/logs/_opt_local_var_macports_sources_rsync.macports.org_release_ports_science_opendx/main.log
Error: Status 1 encountered during processing.
To report a bug, see <http://guide.macports.org/#project.tickets>
Note: See TracQuery for help on using queries.