Custom Query (98 matches)

Filters
 
Or
 
  
 
Columns

Show under each result:


Ticket Summary Owner Type Priority Milestone Component
#7277 apache2, apache20, apache: Protect .ht* and .DS_Store files case-insensitively macports-tickets@… defect High ports
#13877 BUG: mailsync 5.2.1 build fails macports-tickets@… defect Normal ports
#14635 php5-mysql +mysql5: simplify --with-mysql option if possible ryandesign (Ryan Schmidt) enhancement Normal ports
#21117 use_dmg yes fails to copy from some images sometimes ryandesign (Ryan Schmidt) defect Normal MacPorts Future base
#24180 postgres: Incorrect home directory created jyrkiwahlstedt defect Normal ports
#27157 subversion-javahlbindings @1.6.13 +eclipse execution error macports-tickets@… defect Normal ports
#27521 evas: fix dependencies ryandesign (Ryan Schmidt) defect Normal ports
#27528 ImageMagick: expected '#pragma omp' clause before 'omp_throttle' ryandesign (Ryan Schmidt) defect Normal ports
#29165 Defect : xsane does not build universal with gimp support enabled dbevans (David B. Evans) defect Normal ports
#29417 transmission-x11 1.73 does not build on Tiger ryandesign (Ryan Schmidt) defect Normal ports
#30072 terminator does not work ryandesign (Ryan Schmidt) defect Normal ports
#31149 gettext: build still fails when broken grep, sed or awk is installed macports-tickets@… defect Normal ports
#31617 php53 +debug: installs php binary as php.dSYM ryandesign (Ryan Schmidt) defect Normal ports
#32182 ksh93: compiler, arch flags macports-tickets@… defect Normal ports
#33827 cairo: Undefined symbols _cairo_boilerplate_get_target_by_name _cairo_boilerplate_xrealloc _cairo_boilerplate_xmalloc, and links with libraries it doesn't declare dependencies on ryandesign (Ryan Schmidt) defect Normal ports
#33930 Ignore consequences of broken DNS servers ryandesign (Ryan Schmidt) defect Normal base
#34040 py**-gobject: annoying startup warnings macports-tickets@… defect Normal ports
#34403 rpm activation fails on buildbot: __init__.py already exists afb@… defect Normal ports
#34517 stardict: variable length array of non-POD element type alexandernx@… defect Normal ports
#35093 mpkg / mdmg requires cleaning and reinstalling every time macports-tickets@… defect Normal base
#36410 Qt applications are blurry on MBP Retina michaelld (Michael Dickens) enhancement Normal ports
#37092 terminator requires python-keybindings ryandesign (Ryan Schmidt) defect Normal ports
#37203 xcircuit crashes when using tk +aqua macports-tickets@… defect Normal ports
#37385 Qpdf @3.0.2 does not build on PPC Leopard Mac OS X 10.5.8 because of test failure for Pl_ASCII85Decoder macports-tickets@… defect Normal ports
#37583 base: Update m4/tcl.m4 to check for tcl8.6 larryv (Lawrence Velázquez) enhancement Normal base
#37604 doxygen and xorg-libxcb circular dependency macports-tickets@… defect Normal ports
#38005 wireshark doesn't build without libpng opendarwin.org@… defect Normal ports
#39153 Kdevelop will not launch after successful installation NicosPavlov defect Normal ports
#39681 Error in SWIG C++ when installing gnuradio +full on OSX 10.6 michaelld (Michael Dickens) defect Normal ports
#39803 qt4-mac @4.8.5_0 missing dependency: qt4-mac-sqlite3-plugin michaelld (Michael Dickens) defect Normal ports
#40019 pspp 0.8.0 can't find cblas_dsdot () in optimized libgslblas daitakahashi defect Normal ports
#40116 yelp @2.31.6_1: update to 3.8.0? and add quartz support dbevans (David B. Evans) update Normal ports
#40656 Use -isystem instead of -I in default configure.cppflags macports-tickets@… enhancement Normal MacPorts Future base
#41529 Error: org.macports.build for port BGHUDAppKit returned: command execution failed macports-tickets@… defect Normal ports
#41986 port request: 'zmap' macports-tickets@… request Normal ports
#42193 c2html @0.9.6 tries to skip destroot and install directly into prefix macports-tickets@… defect Normal ports
#43021 [NEW] p5-file-sharedir-install macports-tickets@… submission Normal ports
#43025 [NEW] p5-linux-cpuinfo macports-tickets@… submission Normal ports
#43392 ksh93 install fails macports-tickets@… defect Normal ports
#44493 Support globs in port versions macports-tickets@… enhancement Normal base
#45557 wxWidgets-3.0 build error jyrkiwahlstedt defect Normal ports
#45835 MacPorts_Framework @1.2.1_1: needs to be updated to work against modern MacPorts installation macports-tickets@… defect Normal ports
#46658 pulseaudio @5.0_1: builds but doesn't work Ionic (Mihai Moldovan) defect Normal ports
#46700 ffmpeg: add openssl variant dbevans (David B. Evans) enhancement Normal ports
#46939 libcaca 0.99beta1 does not build on Mavericks macports-tickets@… defect Normal ports
#48455 opencv @3.0.0: error: use of undeclared identifier 'PTHREAD_RECURSIVE_MUTEX_INITIALIZER' stromnov (Andrew Stromnov) defect Normal ports
#49169 port selfupdate fails with an imprecise error message when the Xcode license has not been accepted macports-tickets@… defect Normal base
#49431 pkgconfig @0.28: error: unknown type name 'uuid_string_t' ryandesign (Ryan Schmidt) defect Normal ports
#49752 root5, root6: runs "port select root ..." on behalf of user, causing unregistered files to be left on the user's system cjones051073 (Chris Jones) defect Normal ports
#49759 fetch.type {git,bzr} hits buildbot timeout after 20 minutes without output macports-tickets@… defect Normal MacPorts 2.4.0 buildbot/mpbb
#51084 py27-pyqwt fails to compile on OSX 10.11.4 when installing gnuradio michaelld (Michael Dickens) defect Normal ports
#51815 librsvg @2.40.16 does not build on PPC Mac OS X 10.5.8, Leopard, because of "./libtool: eval: line 1085: syntax error near unexpected token `|' " larryv (Lawrence Velázquez) defect Normal ports
#51950 gnuplot unable to find wx/wxprec.h mojca (Mojca Miklavec) defect Normal ports
#52408 Update claws-mail to use webkit2-gtk pmetzger (Perry E. Metzger) defect Normal ports
#52741 cpuid upgrade, should make it build again macports-tickets@… defect Normal ports
#53033 saga doesn't open LAS files Veence (Vincent) enhancement Normal ports
#53117 Braeburn POST requests (Trac, Mailman) are unreliable admin@… defect Normal server/hosting
#54050 ImageMagick: variant to enable or disable multiprocessing with openmp ryandesign (Ryan Schmidt) enhancement Normal ports
#55385 ocaml: fails to build on 10.6 and lower pmetzger (Perry E. Metzger) defect Normal ports
#55546 Install dependencies without asking enhancement Normal base
#56351 rust @1.25.0 won't compile when llvm is installed with the universal variant g5pw (Aljaž Srebrnič) defect Normal ports
#56354 docbook-xsl @1.79.2: broken man page output ryandesign (Ryan Schmidt) defect Normal ports
#56873 Inconsistent behavior between ncurses 6.1.20180127 and ncurses 5.7 jmroot (Joshua Root) defect Normal ports
#57894 Guide: Document required permissions for local repos defect Normal guide
#57911 libcxx @5.0.1_4: does not install without following the LibcxxOnOlderSystems instructions on 10.5 Leopard Intel jeremyhu (Jeremy Huddleston Sequoia) defect Normal ports
#57990 libxml2 @2.9.7_2: ICU include directory not in pkg-config output ryandesign (Ryan Schmidt) defect Normal ports
#58227 libunwind fails to build on 10.14 due to default +universal jeremyhu (Jeremy Huddleston Sequoia) defect Normal ports
#58457 graphviz @2.40.1: configure: error: cannot find output from flex; giving up ryandesign (Ryan Schmidt) defect Normal ports
#58574 poppler upgrade fails if older poppler is installed dbevans (David B. Evans) defect Normal ports
#58751 MacPorts should bundle a newer rsync or allow overriding the default rsync enhancement Normal base
#58764 libgcc-devel @10-20190714 does not build defect Normal ports
#58848 rust @1.36.0: error: Unknown option g5pw (Aljaž Srebrnič) defect Normal ports
#58935 go @1.13: build fails on 10.9 and less ci42 defect Normal ports
#59078 poppler @0.80.0 build fails with Xcode 11.0 on Mojave dbevans (David B. Evans) defect Normal ports
#59124 searchfs @0.3.0: fatal error: 'sys/fsgetpath.h' file not found srirangav (Sriranga Veeraraghavan) defect Normal ports
#59309 mpich: can't read "clist(clang60)": no such element in array eborisch (Eric A. Borisch) defect Normal ports
#59461 mongodb @4.0.13: duplicate symbols ryandesign (Ryan Schmidt) defect Normal ports
#59534 msbuild: error MSB4019: The imported project ... was not found MarcusCalhoun-Lopez (Marcus Calhoun-Lopez) defect Normal ports
#59664 source-highlight @3.1.9 does not build on PPC Mac OS X 10.5.8, Leopard, because new source-highlight binary cannot produc HTML doc from Java source file defect Normal ports
#59700 SSHKeychain @0.8.2: error: could not decode input file using specified encoding: Western (Mac OS Roman), and the file contents appear to be encoded in Unicode (UTF-8) ryandesign (Ryan Schmidt) defect Normal ports
#59757 libpurple: configuration error dbevans (David B. Evans) defect Normal ports
#59798 base should always set ${configure.sdkroot} and $env(SDKROOT) to some value, even, in the end "/". enhancement Normal base
#59945 botan +universal: build failure defect Normal ports
#60087 gcc47 @4.7.4: error: non-local symbol required in directive defect Normal ports
#60273 mail-server installs /Library/LaunchDaemons/org.macports.logrotate.plist not registered to port essandess (Steve Smith) defect Normal ports
#60340 ifeffit: library path to gcc library is baked into configuration file, and is wrong joefowler (Joe Fowler) defect Normal ports
#60345 R-app: error: Compiling for earlier than macOS 10.6 is no longer supported kjellpk (Kjell Konis) defect Normal ports
#60371 legacy-support: needs utimensat kencu (Ken) enhancement Normal ports
#60560 mssql-tools seems to be missing OpenSSL roederja defect Normal ports
#60571 ghc and ports that use ghc: ghc: could not execute: ccache /usr/bin/clang essandess (Steve Smith) defect Normal ports
#60656 lcms2 +universal: build error kencu (Ken) defect Normal ports
#60740 perl5.28: configures with -L/opt/local/lib but strips that out during the build mojca (Mojca Miklavec) defect Normal ports
#60769 svn2git @1.0.18: error: Qt requires a C++11 compiler and yours does not seem to be that. ryandesign (Ryan Schmidt) defect Normal ports
#60982 MacPorts installation fails - OSX SIerra 10.12.6 - Xcode 9.2 - CLT defect Normal base
#61236 $xcodeversion does not calculate the proper version when Xcode is installed in a non-default path. kencu (Ken) defect Normal base
#61371 git @2.29.0 doesn't use configure.sdkroot when building ci42 defect Normal ports
#40112 Julius 4.2.3 fails to upgrade non-universal to universal on 10.6 hem@… defect Low ports
#49501 Spaces and Backslashes in Group Names macports-tickets@… defect Low base
Note: See TracQuery for help on using queries.