New Ticket     Tickets     Wiki     Browse Source     Timeline     Roadmap     Ticket Reports     Search

{16} Tickets filed against a specific port (3697 matches)

Arguments

Use ?PORT=portname in the URL. It allows case-insensitive regex matching.

Results (1701 - 1800 of 3697)

Ticket Port Summary Component Type Owner Status Created
#41687 gcc48 gcc48 @4.8.2 fortran does not work ports defect mww@… new 12/04/13
#41695 vim vim @7.4.052_0+huge+python27 build failure ports defect raimue@… assigned 12/04/13
#41703 fuse4x-kext fuse4x-kext: No architectures to compile for (ARCHS=, VALID_ARCHS=i386 x86_64). ports defect dports@… new 12/05/13
#41705 gettext gettext: build hangs ports defect ryandesign@… new 12/05/13
#41709 digikam Mac OS X- loading two sets of Qt binaries into the same process ports defect jan@… new 12/05/13
#41721 ettercap ettercap: port abandoned ports defect macports-tickets@… new 12/07/13
#41725 VLC VLC won't play from command line ports defect jeremyhu@… new 12/08/13
#41726 bibtex2html bibtex2html requires 'fullpage.sty' ports defect macports-tickets@… new 12/08/13
#41731 R R @3.0.2 installation fails to complete ports defect kjell.konis@… new 12/08/13
#41737 webkit-gtk webkit-gtk is not supported for this installation of MacPorts. It requires libc++ be selected as your C++ runtime. Please use webkit-gtk-2.0 instead ports defect ryandesign@… assigned 12/09/13
#41738 unison unison +aqua @2.40.102_1 does not build on Mavericks ports defect macports-tickets@… new 12/09/13
#41744 herrie herrie @2.2_0: Error: some dependencies are missing <spiff/spiff_c.h> ports defect ed@… new 12/09/13
#41746 mplayer-devel mplayer-devel +osx does not detect freetype when /usr/X11 is present ports defect jeremyhu@… new 12/10/13
#41748 freetype freetype: GNU make (>= 3.80) or makepp (>= 1.19) is required to build FreeType2 ports defect ryandesign@… new 12/10/13
#41749 gdb gdb: dyld: Library not loaded @rpath/libCore.so ports defect dweber@… new 12/10/13
#41750 py-mohotas py-pymorph py-mahotas and py-pymorph not available after install ports defect stromnov@… new 12/10/13
#41752 binutils binutils-2.24 fails to build on PPC Tiger because of "multiple definitions of symbol _filename_cmp" ports defect macports-tickets@… new 12/10/13
#41753 libgcc libgcc-4.8.2_0+universal build fails on fresh reinstall of macports ports defect mww@… new 12/10/13
#41755 mysql-connector-odbc mysql-connector-odbc @5.1.8_1 +universal build failure ports defect pixilla@… new 12/10/13
#41764 dbus dbus: Unprivileged MacPorts: dbus running but acts like it is not. ports defect mcalhoun@… new 12/11/13
#41766 py-numpy py27-numpy @1.8.0_2 +atlas +gcc48 compile error - build failure ports defect dh@… new 12/11/13
#41770 VisualBoyAdvance VisualBoyAdvance @1.7.2_2: error: redefinition of 'i' ports defect jtonio@… new 12/11/13
#41771 The domain/default pair of (/Applications/Xcode.app/Contents/Developer/Applications/Xcode.app/Contents/Info, CFBundleShortVersionString) does not exist ports defect macports-tickets@… new 12/11/13
#41786 Coin Coin @3.1.3 build failure on OS X 10.9 / Xcode 5.02 ports defect css@… new 12/12/13
#41787 wxmsw i386-mingw32-w32api wxmsw @2.8.4: +universal variant fails because i386-mingw32-w32api is not universal ports defect macports-tickets@… new 12/12/13
#41794 gcc48, opencv Gcc48 incompatible with opencv ports defect macports-tickets@… new 12/13/13
#41796 binary package download ignores macosx_deployment_target set globally base defect macports-tickets@… new 12/13/13
#41807 Fonzy Fonzy: gone ports defect phw@… new 12/13/13
#41817 CMake CMake @2.8.12_2: remove /sw paths from installed cmake modules ports defect css@… new 12/14/13
#41821 tesseract Tesseract description should indicate required steps post-install steps ports defect emer@… new 12/15/13
#41824 gtk-doc gtk-doc: configure cannot detect Perl on Snow Leopard ports defect devans@… new 12/15/13
#41825 openexr openexr: configure failure on Mavericks ports defect blair@… new 12/15/13
#41827 MacPorts package installer did not adjust bash PATH base defect macports-tickets@… reopened 12/15/13
#41828 port 2.2.1 mpkg build fails after package has been created base defect macports-tickets@… new 12/15/13
#41833 perl5.12 perl5.12 fails build due to make depend in subdirectory ports defect macports-tickets@… new 12/16/13
#41839 gcr gcr @3.10.1_0 should require gtk2 +x11 ports defect devans@… new 12/17/13
#41849 port 2.2.1: Error: org.macports.archivefetch for port libiconv returned: Failed to fetch signature for archive: The requested URL returned error: 400 Bad Request server/hosting defect wsiegrist@… new 12/18/13
#41862 freetype freetype: freetype-config differs and cannot be merged ports defect ryandesign@… new 12/19/13
#41864 php52 php52 @5.2.17_8+fastcgi: configure cannot find freetype.h ports defect ryandesign@… assigned 12/20/13
#41871 lparse Lparse @1.1.2 - error when staging lparse into destroot ports defect snc@… new 12/21/13
#41872 cyrus-sasl2 cyrus-sasl2 @2.1.26_3 +kerberos+sql+universal: muniversal destroot merge failure ports defect macports-tickets@… new 12/21/13
#41873 lablgtk lablgtk @1.2.7_4: build failure for gList.ml ports defect macports-tickets@… new 12/21/13
#41874 exempi Exempi patch causes python ctypes problem, relates to ticket 20965 ports defect devans@… assigned 12/21/13
#41875 slirp slirp @1.0.17: ror: second parameter of 'main' (argument array) must be of type 'char **' ports defect ryandesign@… assigned 12/21/13
#41876 maven-ant-tasks maven-ant-tasks cannot find JAVA_HOME correctly ports defect ieure@… new 12/21/13
#41880 Mavericks buildbot buildslave hangs fetching from git server/hosting defect skarulkar@… new 12/22/13
#41886 p5-x11-protocol cssh can not be started due to a bug in Protocol.pm ports defect sal@… new 12/22/13
#41894 autotrace Build of autotrace 0.31.1_9 does not detect installed pstoedit ports defect macports-tickets@… new 12/23/13
#41895 ghostscript ghostscript @9.10: missing font packages ports defect takanori@… new 12/23/13
#41904 notmuch Notmuch will not build under Mavericks. ports defect yeled@… new 12/23/13
#41917 libgcc-devel libgcc-devel @4.9-20131215: internal compiler error: Illegal instruction ports defect mww@… new 12/24/13
#41918 R R @3.0.2_1: +atlas variant fails to build ports defect kjell.konis@… new 12/24/13
#41924 v8 v8 @3.23.15: build fails on lion buildslave and icu confusion ports defect frodwith@… new 12/24/13
#41930 py27-game py-game: cannot initialize pygame screen ports defect jmr@… new 12/25/13
#41937 cacti Cacti port fails on Mavericks ports defect markd@… new 12/26/13
#41948 libplist libplist @1.10_0+python27: build error ports defect rmstonecipher@… new 12/27/13
#41950 libusb libusb: no destroot found ports defect rwilcox@… new 12/27/13
#41951 spim spim @7.4_2: fatal error: ' X11 .rules' file not found ports defect macports-tickets@… new 12/27/13
#41955 enblend enblend @4.1.2_1: build fails with texinfo 5 ports defect hvdwolf@… new 12/28/13
#41957 tokyocabinet-clj tokyocabinet-clj @20090505: wrong github address ports defect ieure@… new 12/28/13
#41961 ophcrack ophcrack configure/build error ports defect cedric.luthi@… new 12/28/13
#41966 gnudatalanguage gnudatalanguage @0.9.4_3 +gshhs Runtime Error - PLplot installation lacks the requested driver: xwin ports defect macports-tickets@… new 12/29/13
#41967 secpwgen cryptlib secpwgen @1.3_1 cryptlib error: -20 ports defect macports-tickets@… new 12/29/13
#41972 latex2man latex2man @1.23: imprecise dependency on texlive ports defect larryv@… assigned 12/30/13
#41976 camlimages upgrade for camlimages fails ports defect reilles@… new 12/30/13
#41981 py-game py32-game seems broken on 10.8.5 ports defect jmr@… new 12/31/13
#41984 gtksourceview2 gtksourceview2 fails to build ports defect micah.lerner@… new 12/31/13
#41995 db46 db46 @4.6.21_9 update fails "build Command failed" ports defect blair@… new 01/01/14
#42006 gpick gpick: fatal error: 'libintl.h' file not found ports defect macports-tickets@… new 01/03/14
#42008 cssed cssed: ld: symbol(s) not found for architecture x86_64 ports defect macports-tickets@… new 01/03/14
#42009 aspell aspell fails to build with macports-clang-3.4 ports defect jochen@… new 01/03/14
#42011 perl5.12 perl5.12: error: Availability.h: No such file or directory ports defect macports-tickets@… new 01/03/14
#42014 gjs gjs build failure ports defect juanrgar@… new 01/03/14
#42020 soprano Mavericks: Error: soprano requires the Java for Mac OS X development headers. ports defect pixilla@… new 01/04/14
#42029 qt4-mac qt4-mac: Undefined symbols _dbus_shutdown ports defect michaelld@… new 01/05/14
#42030 alliance alliance @5.0: error: incompatible type for argument 2 of 'chktab' ports defect macports-tickets@… new 01/05/14
#42031 expat expat: expat-2.1.0.tar.gz does not exist in /opt/local/var/macports/distfiles/expat ports defect ryandesign@… new 01/05/14
#42037 gnome-games gnome-games: port outdated, replaced by new individual GNOME packages, maintainers wanted. ports defect macports-tickets@… new 01/06/14
#42045 cgminer cgminer @3.9.0 knc varient causes compilation error ports defect ram@… new 01/07/14
#42049 openssl openssl @1.0.1f: x86cpuid.s:327:Rest of line ignored. 1st junk character valued 44 (,). ports defect mww@… new 01/07/14
#42051 llvm-3.3 llvm-3.3: found python 2.3.5 (/usr/bin/python); required >= 2.5 ports defect ryandesign@… new 01/07/14
#42053 openssl openssl @1.0.1f_0 violates the layout of the ports-filesystems - activation failure ports defect mww@… new 01/07/14
#42055 freeradius freeradius @2.1.9_2 - Update overwrites all config files ports defect macports-tickets@… new 01/08/14
#42061 mysql5 mysql5: uses /usr/lib/libstdc++.6.dylib as C++ standard library although macports::cxx_stdlib is set to libc++ ports defect ryandesign@… new 01/08/14
#42065 squid Squid runaway child processes at boot, commBind: Cannot bind socket FD NN to *:3128: (48) Address already in use ports defect jmr@… new 01/08/14
#42070 lua lua @5.2.2_1 arrow keys don't work in interpreter ports defect macports-tickets@… new 01/09/14
#42079 hs-citeproc [hs-citeproc] configure step fails with "missing dependency: json -any" ports defect cal@… new 01/09/14
#42081 hs-data-default [hs-data-default] configure step fails with "missing dependency: data-default-instances-containers -any" ports defect cal@… new 01/09/14
#42082 pandoc [pandoc]: configure step fails with "missing dependencies..." ports defect cal@… new 01/09/14
#42091 ghc ghc does not build ports defect kitchen.andy@… new 01/10/14
#42092 ghc-bootstrap ghc-bootstrap does not build ports defect kitchen.andy@… new 01/10/14
#42093 neverball Neverball 1.5.4_3 build failure ports defect mvitocruz@… new 01/10/14
#42100 arpack arpack 3.1.3_0+accelerate+gcc48+universal: i386 configure cannot find BLAS ports defect mmoll@… new 01/11/14
#42101 qpdf upgrading qpdf attempts to link with old library ports defect dojo@… new 01/12/14
#42102 py27-pip py27-pip targets wrong python ports defect stromnov@… new 01/12/14
#42105 fop fop and other java ports should check for JVM on activation ports defect macports-tickets@… new 01/12/14
#42111 gettext gettext @18.3.2 hangs and crashes computer when attempting upgrade ports defect ryandesign@… new 01/13/14
#42121 coq coq: building with the variant +doc fails ports defect macports-tickets@… new 01/14/14
#42122 coq coq: cannot start coqide ports defect macports-tickets@… new 01/14/14
#42123 atlas Cannot install Atlas ports defect vince@… new 01/14/14
Note: See TracReports for help on using and creating reports.