New Ticket     Tickets     Wiki     Browse Source     Timeline     Roadmap     Ticket Reports     Search

{16} Tickets filed against a specific port (3777 matches)

Arguments

Use ?PORT=portname in the URL. It allows case-insensitive regex matching.

Results (1201 - 1300 of 3777)

3 4 5 6 7 8 9 10 11 12 13 14 15 16 17 18 19 20 21 22 23
Ticket Port Summary Component Type Owner Status Created
#42702 glibtool glibtool drops dylibs at link time ports defect macports-tickets@… new 03/02/14
#29476 maxima, sbcl sbcl +threads does not compile maxima (snow leopard, x86_64) ports defect macports-tickets@… new 05/15/11
#35670 could not set effective gid to 0 base defect macports-tickets@… new 08/14/12
#23910 siag siag-3.6.0 fails to build ports defect macports-tickets@… new 03/02/10
#20018 scribus Scribus @1.3.3.11 compile fails: cairo-xlib.h: No such file ports defect macports-tickets@… new 06/20/09
#35659 jikesrvm jikesrvm: /usr/bin/jikes: Command not found ports defect macports-tickets@… new 08/13/12
#35653 gconf gconf 2.28.1_3 +quartz connections from client to gconfd fail ports defect macports-tickets@… new 08/13/12
#29371 duplicity duplicity: list index out of range error when running a restore ports defect macports-tickets@… new 05/04/11
#42779 asn1c asn1c @0.9.24 compile fails due to missing symbols on Snow Leopard ports defect macports-tickets@… new 03/09/14
#43689 xorg-libpthread-stubs xorg-libpthread-stubs: Failed to fetch signature for archive: The requested URL returned error: 400 Bad Request ports defect macports-tickets@… new 05/12/14
#35575 xfree86 unable to install xfree86 ports defect macports-tickets@… new 08/07/12
#35543 SuiteSparse SuiteSparse fails to build on Tiger, G3 ports defect macports-tickets@… new 08/05/12
#23858 FAQ needs info on how to build for i386 on 10.6 (64 bit kernel) wiki defect macports-tickets@… new 02/25/10
#16102 gcc43 gcc43 4.3.1_1 - No port for GDB and Apple GDB fails to debug mp-gcc43 executables ports defect macports-tickets@… new 07/25/08
#35538 opendx opendx is not UsingTheRightCompiler ports defect macports-tickets@… new 08/05/12
#29196 boost-gil-numeric boost-gil-numeric @1.0 (devel), gil examples which come with the boost package fail to compile ports defect macports-tickets@… new 04/18/11
#19999 nss nss: signtool library search path busted ports defect macports-tickets@… new 06/18/09
#35471 gconf Gconf-sanity-check-2 fails ports defect macports-tickets@… new 08/01/12
#23800 rabbitmq-server rabbitmq-server fails install phase when startupitem_type is none ports defect macports-tickets@… new 02/21/10
#42785 db46 db46: error: no member named 'seq' in 'struct __db' ports defect macports-tickets@… reopened 03/09/14
#45198 kaffe kaffe update to 1.1.9 fails, need libtool 1.5? ports defect macports-tickets@… new 09/28/14
#41873 lablgtk lablgtk @1.2.7_4: build failure for gList.ml ports defect macports-tickets@… new 12/21/13
#43988 mipsel-linux-binutils mipsel-linux-binutils @2.16.1_3: @itemx must follow @item ports defect macports-tickets@… new 06/10/14
#35370 hamcrest-core hamcrest-core fails to build on Mountain Lion ports defect macports-tickets@… new 07/27/12
#23795 sane-backends xsane GIMP xsane plugin does not recognize scanners ports defect macports-tickets@… new 02/20/10
#45171 libcaca libcaca: Undefined symbols ports defect macports-tickets@… new 09/26/14
#35341 Xcode not found when user directory is not on main drive base defect macports-tickets@… new 07/26/12
#35328 w3m w3m @0.5.3 build failure: func.c:200:24: error: use of undeclared identifier 'functable' ports defect macports-tickets@… new 07/26/12
#29148 miredo miredo crashes due to behaviour disallowed by libdispatch ports defect macports-tickets@… new 04/15/11
#23793 rb-bioruby, rb-dbd-mysql, rb-dbd-pg rb-bioruby depends on nonexistent ports rb-dbd-mysql and rb-dbd-pg ports defect macports-tickets@… new 02/20/10
#19998 jamvm gnu-classpath jamvm 1.5.0 and gnu-classpath 0.93: /opt/local/include/jni.h conflict ports defect macports-tickets@… new 06/18/09
#42739 zenity zenity on Maverics errors with GTK-warning cannot open display ports defect macports-tickets@… new 03/05/14
#23772 cmake InsightToolkit InsightToolKit: fix linking against python 2.6 framework ports defect macports-tickets@… new 02/18/10
#38452 apache2 Information disclosure vulnerability with apache2 and other web servers ports defect macports-tickets@… new 03/20/13
#35230 p5.12-mail-spamassassin p5.12-mail-spamassassin @3.2.5, Revision 6, runtime warnings, uses deprecated perl constucts ports defect macports-tickets@… new 07/17/12
#35228 pear-PHPUnit pear-PHPUnit 3.6.11 wil not build ports defect macports-tickets@… new 07/17/12
#23754 distcc pump mode in distcc ports defect macports-tickets@… new 02/17/10
#41966 gnudatalanguage gnudatalanguage @0.9.4_3 +gshhs Runtime Error - PLplot installation lacks the requested driver: xwin ports defect macports-tickets@… new 12/29/13
#14172 unison unison upgrade removed unison-2.13 - synchronization with some machines fails ports defect macports-tickets@… new 02/03/08
#41967 secpwgen cryptlib secpwgen @1.3_1 cryptlib error: -20 ports defect macports-tickets@… new 12/29/13
#42792 py-python-daemon py27-python-daemon @1.5.5: missing dependency ports defect macports-tickets@… new 03/10/14
#42989 avidemux avidemux @2.6.6_2 build (configure) failure under 10.9 ports defect macports-tickets@… new 03/22/14
#35149 arm-aout-gcc arm-aout-gcc: cc1: internal compiler error: Segmentation fault: 11 ports defect macports-tickets@… new 07/10/12
#29009 port incorrectly detects some ports as uninstalled base defect macports-tickets@… new 04/02/11
#28997 zsh-templates-osx zsh-templates-osx architecture mismatch ports defect macports-tickets@… new 04/01/11
#35093 mpkg / mdmg requires cleaning and reinstalling every time base defect macports-tickets@… reopened 07/05/12
#15790 gerris Missing dependencies for Gerris ports defect macports-tickets@… new 06/29/08
#45151 git bash-completion git bash_completion with egrep colors ports defect macports-tickets@… new 09/24/14
#28960 Pallet Pallet failure on 10.6.7 ports defect macports-tickets@… new 03/29/11
#42703 fontforge FontForge builds + fails to find MacPorts X11 at runtime ports defect macports-tickets@… new 03/03/14
#35066 grace grace @5.1.22_6 - Grace crash on Print ports defect macports-tickets@… new 07/03/12
#44198 libxslt libxslt: Failed to fetch signature for archive: The requested URL returned error: 400 Bad Request ports defect macports-tickets@… new 06/30/14
#45310 py27-pyobjc py27-pyobjc build fails with setuptools 6 ports defect macports-tickets@… new 10/09/14
#13900 DesktopManager DesktopManager-0.5.3: Undefined symbols: _CGSCreateCStringNoCopy ports defect macports-tickets@… new 01/12/08
#35022 glob2 glob2: error: reference to 'Collection' is ambiguous ports defect macports-tickets@… new 06/29/12
#42732 mpfr mpfr @3.1.1-p2: test suite fails on x86_64 Snow Leopard (when run with `port test gmp mpfr libmpc`) ports defect macports-tickets@… new 03/05/14
#34990 shogun shogun: Undefined symbols: _drot_ _dswap_ __gfortran_concat_string _dgemm_ etc. ports defect macports-tickets@… new 06/27/12
#42725 'port pkg' still requires PackageMaker.app base defect macports-tickets@… new 03/04/14
#34954 user macports needs write access on Preferences directory base defect macports-tickets@… new 06/22/12
#28923 rancid rancid: universal variant fails ports defect macports-tickets@… new 03/26/11
#42733 libmpc libmpc @1.0.2: testsuite fails ports defect macports-tickets@… new 03/05/14
#45956 FreeRDP FreeRDP @1.1.0-beta-2013071101_7: fatal error: 'MacFreeRDP-library/MRDPView.h' file not found ports defect macports-tickets@… new 11/20/14
#28873 shogun shogun @0.9.3 build failure ports defect macports-tickets@… new 03/22/11
#43741 perl5.16 cpan fails to install any module ports defect macports-tickets@… new 05/17/14
#34906 kerberos5 installing kerberos5 breaks OS X' ssh ports defect macports-tickets@… new 06/18/12
#28839 perl5.12 perl5.12 won't compile with Xcode 4 on 10.6 ports defect macports-tickets@… new 03/19/11
#41534 abiword abiword @2.4.5: error: incomplete definition of type 'struct png_info_def' ports defect macports-tickets@… new 11/25/13
#45911 py27-h5py, openmpi-gcc48 py27-h5py @2.3.1_1 built against parallel HDF5 can't find mpi.h ports defect macports-tickets@… new 11/16/14
#41539 mysql-connector-java mysql-connector-java build depends on ant-contrib ports defect macports-tickets@… new 11/25/13
#34887 ehcache ehcache 1.1.0 CVS login failed ports defect macports-tickets@… new 06/16/12
#45926 py27-numpy Error upgrading py27-numpy from 1.9.0_0 to 1.9.1_0 ports defect macports-tickets@… new 11/17/14
#45940 gstreamer1-gst-plugins-base gstreamer1-gst-plugins-base @ 1.4.4_0: fails to build on Mavericks 10.9.5 ports defect macports-tickets@… new 11/19/14
#28756 gthumb gthumb 2.12.2 image edit tools greyed out ports defect macports-tickets@… new 03/12/11
#41523 gtkwave gtkwave misses dependency to gtk-osx-application, build fails for variant -x11 +no_x11 +quartz ports defect macports-tickets@… new 11/24/13
#41488 rbenv rbenv @0.4.0 fails to initialize shell completion ports defect macports-tickets@… new 11/21/13
#19513 ncbi_tools ncbi_tools-20080302 data files not installed by portfile ports defect macports-tickets@… new 05/01/09
#34852 powerpc-rtems-gcc powerpc-rtems-gcc @4.2.3 doesn't compile with its default compiler ports defect macports-tickets@… new 06/13/12
#23584 automoc automoc doesn't build on Tiger ports defect macports-tickets@… new 02/06/10
#43721 freeciv-x11 freeciv-gtk2 (of freeciv-x11 2.4.2) fails with "Abort Trap: 6" ports defect macports-tickets@… new 05/16/14
#41468 angelscript angelscript: Inline asm clobbers must be last on the x87 stack ports defect macports-tickets@… new 11/20/13
#28571 mod_mono mod_mono is not going to work like this ports defect macports-tickets@… new 02/28/11
#41452 Fetching distfiles will inexplicably hang in Mavericks ports defect macports-tickets@… new 11/19/13
#41442 zenity fails under mavericks ports defect macports-tickets@… new 11/19/13
#34832 PORT/work/.home/.subversion and proxy access base defect macports-tickets@… new 06/11/12
#42161 grass grass: compatibility with wxWidgets 3.0 ports defect macports-tickets@… new 01/17/14
#41440 python27 python27 +universal build fail ports defect macports-tickets@… new 11/18/13
#34823 cdrtools cdrtools: missing isoinfo, mkhybrid, and mkisofs ports defect macports-tickets@… new 06/10/12
#34806 mkvtoolnix mkvtoolnix needs boost and icu built with same compiler ports defect macports-tickets@… reopened 06/08/12
#41434 magicpoint magicpoint @1.13a - fatal error: ' X11 .rules' file not found ports defect macports-tickets@… new 11/18/13
#28684 clojure Clojure won't compile my programs ports defect macports-tickets@… new 03/06/11
#28494 kdelibs4 kdelibs4 @4.6.0 +kdesdk4 on Tiger 10.4.11 PPC proxymodeltest Declaration errors - Build failure ports defect macports-tickets@… new 02/20/11
#43697 mutt-devel mutt-devel in ports still segfaults in mx_update_context ports defect macports-tickets@… new 05/13/14
#41529 BGHUDAppKit Error: org.macports.build for port BGHUDAppKit returned: command execution failed ports defect macports-tickets@… reopened 11/25/13
#34877 avahi avahi: opportunistic linking? ports defect macports-tickets@… new 06/15/12
#45675 cryptlib cryptlib @3.4.2 fails to build on 10.10 with XCode 6.1 ports defect macports-tickets@… new 10/28/14
#45961 vlc VLC build seems to be missing things, particularly some subtitle support ports defect macports-tickets@… new 11/20/14
#41425 tcpflow tcpflow @1.4.2: SSL certificate problem, verify that the CA cert is OK ports defect macports-tickets@… new 11/18/13
#28492 p5-mail-spamassassin, p5-db_file p5-mail-spamassassin @3.2.5 +ssl sa-learn db_file module install problem ports defect macports-tickets@… new 02/20/11
#41948 libplist libplist @1.10_0+python27: build error ports defect macports-tickets@… new 12/27/13
#34750 py-numpy py32-numpy fails to build on snow leopard/XCode4.2 ports defect macports-tickets@… new 06/04/12
3 4 5 6 7 8 9 10 11 12 13 14 15 16 17 18 19 20 21 22 23
Note: See TracReports for help on using and creating reports.