New Ticket     Tickets     Wiki     Browse Source     Timeline     Roadmap     Ticket Reports     Search

{16} Tickets filed against a specific port (4037 matches)

Arguments

Use ?PORT=portname in the URL. It allows case-insensitive regex matching.

Results (501 - 600 of 4037)

1 2 3 4 5 6 7 8 9 10 11 12 13 14 15 16
Ticket Port Summary Component Type Owner Status Created
#33545 bullet bullet: The following variables are used in this project, but they are set to NOTFOUND: OPENCL_LIBRARY ports defect stromnov@… new 03/08/12
#33561 gcc48 gcc48: Selecting 'mp-gcc48' for 'gcc' failed ... gcj": target ports defect mww@… new 03/09/12
#33613 criticalmass criticalmass: memalloc errors ports defect macports-tickets@… new 03/13/12
#33647 perl p5 ports: 5.12.3: no such file or directory ports defect macports-tickets@… new 03/16/12
#33658 gcc47 gcc47 @4.7-20120225 on 10.5.8 PPC - internal compiler error ports defect mww@… new 03/17/12
#33673 libpqxx libpqxx: tests don't work ports defect macports-tickets@… new 03/18/12
#33684 autogen autogen 5.15 fails shell.hlp test case on case-insensitive filesystems ports defect mww@… new 03/19/12
#33696 ffmpeg ffmpeg: Cannot build with XCode 4.3.1 for 64 bit ports defect devans@… new 03/20/12
#33697 Incomplete uninstall script guide defect macports-tickets@… new 03/20/12
#33701 LyX LyX spotlight plugin can't be loaded ports defect khindenburg@… new 03/20/12
#33708 cuneiform cuneiform @1.1.0_0 Error during execution: Abort trap: 6 ports defect macports-tickets@… new 03/21/12
#33714 awesome Awesome @3.4.11: cannot find default config ports defect macports-tickets@… new 03/21/12
#33720 python26, python27 Cannot use non-ascii in the Python interactive shell ports defect macports-tickets@… new 03/22/12
#33732 ccl ccl 1.7.1 fails to compile on darwin 9.8.0 ports defect easieste@… new 03/23/12
#33757 ipe ipe @7.1.2 (graphics); build fails on image.o ports defect m.thon@… new 03/25/12
#33766 cherokee cherokee: universal variant fails ports defect michael@… new 03/26/12
#33767 cherokee cherokee links with libraries it doesn't declare dependencies on ports defect michael@… new 03/26/12
#33772 texinfo texinfo: cannot display the flex documentation ports defect macports-tickets@… new 03/26/12
#33788 exact-image exact-image looks for X11 in /usr/X11 ports defect macports@… new 03/27/12
#33792 libbonobo libidl libbonobo: ../idl/Bonobo.idl compilation failed ports defect macports-tickets@… new 03/27/12
#33802 gtk2 gtk2 build failure on 10.8: incomplete definition of type 'struct _ipp_s' ports defect macports-tickets@… new 03/28/12
#33827 cairo, cairo-devel cairo: Undefined symbols _cairo_boilerplate_get_target_by_name _cairo_boilerplate_xrealloc _cairo_boilerplate_xmalloc, and links with libraries it doesn't declare dependencies on ports defect ryandesign@… reopened 03/30/12
#33830 evince gv evince and gv both fail to display PostScript correctly ports defect macports-tickets@… new 03/30/12
#33831 binutils binutils: gnm reports negative symbol sizes ports defect macports-tickets@… new 03/30/12
#33857 InsightToolkit InsightToolkit: error: use of undeclared identifier 'equal' ports defect macports-tickets@… new 04/01/12
#33859 p5.12-gtk2 p5.12-gtk2 does not compile on MacOS X Lion ports defect macports-tickets@… new 04/02/12
#33860 sword sword: error: use of undeclared identifier 'find' ports defect macports-tickets@… new 04/02/12
#33886 xinit Startx script cannot handle fake domain names on PPC Tiger? ports defect macports-tickets@… new 04/03/12
#33930 Ignore consequences of broken DNS servers base defect ryandesign@… reopened 04/07/12
#33932 Erroneous "Missing subversion property on Portfile" error base defect macports-tickets@… new 04/08/12
#33989 vtk44 VTK: error: 'strcmp' was not declared in this scope ports defect css@… new 04/10/12
#33998 akonadi kdepim4 no kdepim4 application work. ports defect macports-tickets@… new 04/11/12
#34012 openal openal: error: 'CAStreamBasicDescription.h' file not found ports defect macports-tickets@… new 04/12/12
#34040 py25-gobject, py26-gobject, py27-gobject py**-gobject: annoying startup warnings ports defect macports-tickets@… reopened 04/14/12
#34063 pear-XML_Util pear-XML_Util- installer/bin/pear: No such file or directory ports defect pixilla@… new 04/15/12
#34098 cairo Cairo Build Issue ports defect ryandesign@… new 04/17/12
#34124 openal openal: update to latest version ports defect macports-tickets@… new 04/19/12
#34129 groff groff @1.21_2 build failure: "fatal error: invalid device `html'" ports defect macports-tickets@… new 04/19/12
#34183 gstreamer010-gst-plugins-ugly gst-plugins-ugly @0.10.19_2 missing headers ports defect macports-tickets@… new 04/23/12
#34186 evince evince @2.30.3 configure failure: "PDF support is disabled since poppler-glib library version 0.12.0 or newer not found" ports defect devans@… new 04/23/12
#34212 liblrdf liblrdf compilation problems ports defect pixilla@… new 04/25/12
#34215 gstreamer010-gst-plugins-base gst-plugins-base @0.10.36_1 +universal destroot failure ports defect macports-tickets@… new 04/25/12
#34224 n2n n2n: subversion check out failed, certificate issued for a different hostname ports defect msmk@… new 04/25/12
#34228 php5 php5: fsockopen don't work since php 5.3.10, with openssl 1.0.1b_0 ports defect ryandesign@… new 04/26/12
#34231 ImageMagick ImageMagick: should not depend on pango + fix openMP ports defect ryandesign@… new 04/27/12
#34256 tex-whizzytex tex-whizzytex @1.3.1 Configure failure: "Cannot run initex with any of the formats: latex latex" ports defect macports-tickets@… new 04/29/12
#34264 digikam digikam: Undefined symbols for architecture x86_64 ports defect jan@… new 04/30/12
#34271 py25-gtk py27-gtk py26-gtk py27-gobject py26-gobject py25-gobject python26 python27 python27 2.7.3_0 py27-gtk 2.22.0_1 etc -- pkg-config files not installed correctly for python 2.6 and 2.7 versions of pygtk and pygobject ports defect macports-tickets@… new 04/30/12
#34305 vtk44 VTK: error: ‘FSSpec’ has no member named ‘name’ ports defect css@… new 05/02/12
#34308 pkgconfig pkgconfig: Undefined symbols ports defect ryandesign@… new 05/02/12
#34339 gdal gdal +framework variant fails to install ports defect vince@… new 05/04/12
#34383 curl curl @7.25.0 SFTP fails with "Failure establishing ssh session" (2) ports defect ryandesign@… new 05/09/12
#34389 strategoxt strategoxt fails to install ports defect macports-tickets@… new 05/09/12
#34403 rpm rpm activation fails on buildbot: __init__.py already exists ports defect afb@… reopened 05/10/12
#34412 apt apt will not compile at the end ports defect landonf@… new 05/11/12
#34415 dbus-devel dbus-devel: build fails ports defect pixilla@… new 05/11/12
#34417 nu2 nu2: fatal error: 'Foundation/Foundation.h' file not found ports defect macports-tickets@… new 05/11/12
#34427 playerstage-player playerstage-player: build uses /Library/Frameworks/Python.framework, fails ports defect vincent@… new 05/12/12
#34447 freeciv freeciv 2.3.2 not compiling with global variants set to -x11 +no_x11 ports defect macports-tickets@… new 05/14/12
#34470 xgraph xgraph segmentation fault ports defect ryandesign@… assigned 05/16/12
#34502 ogre ogre@1.7.3 - pbxcp command execution failed, build failed. ports defect marin@… assigned 05/18/12
#34538 soprano Soprano 2.7.4 fails to build with wrong-arch iodbc.framework in /Library/Frameworks ports defect pixilla@… new 05/20/12
#34539 ophcrack ophcrack: add fast and small variants ports defect macports-tickets@… new 05/20/12
#34548 dansguardian dansguardian doesn't start anymore since upgrade to macports 2.1.0 ports defect macports-tickets@… new 05/20/12
#34566 unison unison: uigtk2.cmx and /opt/local/lib/ocaml/lablgtk2/lablgtk.cmxa make inconsistent assumptions over implementation GtkSignal ports defect macports-tickets@… new 05/21/12
#34572 samba3 samba3 @3.6.5 fails to initialize on startup ports defect macports-tickets@… new 05/21/12
#34592 ImageMagick ImageMagick: do not link with linkclparser.dylib on Snow Leopard ports defect ryandesign@… new 05/23/12
#34639 gdc gdc @0.24 Build failure due to redefinition of functions ports defect mww@… new 05/27/12
#34675 gdk-pixbuf gdk-pixbuf fails to compile on x86_64 (Lion) ports defect macports-tickets@… new 05/30/12
#34702 nagios-plugins nagios-plugins +universal fails: -E, -S, -save-temps and -M options are not allowed with multiple -arch flags ports defect macports-tickets@… new 05/31/12
#34714 mozart mozart 1.4.0_1 build failure ports defect bfulgham@… new 06/01/12
#34758 ImageMagick ImageMagick +rsvg needs xorg-xcb ports defect ryandesign@… new 06/04/12
#34823 cdrtools cdrtools: missing isoinfo, mkhybrid, and mkisofs ports defect macports-tickets@… new 06/10/12
#34832 PORT/work/.home/.subversion and proxy access base defect macports-tickets@… new 06/11/12
#34837 libwpd libwpd @0.8.14_0 +universal Build failure ports defect devans@… new 06/11/12
#34852 powerpc-rtems-gcc powerpc-rtems-gcc @4.2.3 doesn't compile with its default compiler ports defect macports-tickets@… new 06/13/12
#34863 peekabot-server peekabot-server: ‘class boost::asio::basic_stream_socket<boost::asio::ip::tcp, boost::asio::stream_socket_service<boost::asio::ip::tcp> >’ has no member named ‘io_service’ ports defect staffan@… new 06/14/12
#34877 avahi avahi: opportunistic linking? ports defect macports-tickets@… new 06/15/12
#34885 nagios-plugins nagios-plugins does not list library dependencies ports defect macports-tickets@… new 06/16/12
#34887 ehcache ehcache 1.1.0 CVS login failed ports defect macports-tickets@… new 06/16/12
#34891 swig swig: subports do not respect build_arch ports defect michaelld@… new 06/16/12
#34895 reduce-algebra reduce-algebra installs but does not run ports defect mark.brethen@… new 06/17/12
#34906 kerberos5 installing kerberos5 breaks OS X' ssh ports defect macports-tickets@… new 06/18/12
#34935 Moving a port from /users to /trunk/dports or changing a file in portdir/files doesn't trigger buildbot rebuild server/hosting defect admin@… new 06/19/12
#34945 liblrdf liblrdf: ../libtool: command not found ports defect pixilla@… new 06/20/12
#34954 user macports needs write access on Preferences directory base defect macports-tickets@… new 06/22/12
#34962 ghostscript ghostscript cannot be built for archs that cannot be run ports defect macports-tickets@… new 06/24/12
#34975 expat expat: Failed to verify signature for archive! ports defect ryandesign@… new 06/26/12
#34990 shogun shogun: Undefined symbols: _drot_ _dswap_ __gfortran_concat_string _dgemm_ etc. ports defect macports-tickets@… new 06/27/12
#34995 libgweather Segfault building libgweather @ 2.30.3 ports defect devans@… new 06/27/12
#35022 glob2 glob2: error: reference to 'Collection' is ambiguous ports defect macports-tickets@… new 06/29/12
#35033 python26, python27 python26, python27: Build Applet looking for /Volumes/work/macports/Library/Frameworks/Python.framework/Versions/2.X/Resour ports defect jwa@… new 06/30/12
#35036 kde4-baseapps, kdegames4 kde4 baseapps crash (compiled from source for different root tree) ports defect nicos@… new 06/30/12
#35066 grace grace @5.1.22_6 - Grace crash on Print ports defect macports-tickets@… new 07/03/12
#35070 gcc47 gcc47: _GLIBCXX_DEBUG and empty ostringstream ports defect mww@… new 07/03/12
#35088 opencv OpenCV 2.4.1 has a bug on the pkg-config files ports defect stromnov@… new 07/05/12
#35089 ImageMagick ImageMagick 6.7.8 ImageMagick++ is broken ports defect ryandesign@… new 07/05/12
#35093 mpkg / mdmg requires cleaning and reinstalling every time base defect macports-tickets@… reopened 07/05/12
#35112 arm-none-linux-gnueabi-gcc arm-none-linux-gnueabi-gcc: error: duplicate case value '0' ports defect stuartwesterman@… new 07/07/12
#35136 despotify despotify: no sound ports defect mail@… new 07/09/12
1 2 3 4 5 6 7 8 9 10 11 12 13 14 15 16
Note: See TracReports for help on using and creating reports.