New Ticket     Tickets     Wiki     Browse Source     Timeline     Roadmap     Ticket Reports     Search

{1} Active Tickets (3813 matches)

  • List all active tickets by priority.
  • Color each row based on priority.

Results (1301 - 1400 of 3813)

Ticket Summary Component Version Milestone Type Owner Status Created
#41709 Mac OS X- loading two sets of Qt binaries into the same process ports 2.2.1 defect jan@… new 12/05/13
#41725 VLC won't play from command line ports 2.2.1 defect jeremyhu@… new 12/08/13
#41731 R @3.0.2 installation fails to complete ports 2.2.1 defect kjell.konis@… new 12/08/13
#41737 webkit-gtk is not supported for this installation of MacPorts. It requires libc++ be selected as your C++ runtime. Please use webkit-gtk-2.0 instead ports 2.2.1 defect ryandesign@… assigned 12/09/13
#41738 unison +aqua @2.40.102_1 does not build on Mavericks ports 2.2.1 defect macports-tickets@… new 12/09/13
#41744 herrie @2.2_0: Error: some dependencies are missing <spiff/spiff_c.h> ports 2.2.1 defect macports-tickets@… new 12/09/13
#41746 mplayer-devel +osx does not detect freetype when /usr/X11 is present ports 2.2.1 defect jeremyhu@… new 12/10/13
#41749 gdb: dyld: Library not loaded @rpath/libCore.so ports 2.2.1 defect stuartwesterman@… new 12/10/13
#41750 py-mahotas and py-pymorph not available after install ports 2.2.1 defect stromnov@… new 12/10/13
#41752 binutils-2.24 fails to build on PPC Tiger because of "multiple definitions of symbol _filename_cmp" ports 2.2.99 defect macports-tickets@… new 12/10/13
#41755 mysql-connector-odbc @5.1.8_1 +universal build failure ports 2.2.1 defect pixilla@… new 12/10/13
#41766 py27-numpy @1.8.0_2 +atlas +gcc48 compile error - build failure ports 2.2.1 defect dh@… new 12/11/13
#41770 VisualBoyAdvance @1.7.2_2: error: redefinition of 'i' ports 2.2.1 defect jtonio@… new 12/11/13
#41771 The domain/default pair of (/Applications/Xcode.app/Contents/Developer/Applications/Xcode.app/Contents/Info, CFBundleShortVersionString) does not exist ports 2.2.1 defect macports-tickets@… new 12/11/13
#41787 wxmsw @2.8.4: +universal variant fails because i386-mingw32-w32api is not universal ports 2.2.1 defect macports-tickets@… new 12/12/13
#41794 Gcc48 incompatible with opencv ports 2.2.1 defect macports-tickets@… new 12/13/13
#41796 binary package download ignores macosx_deployment_target set globally base 2.2.1 defect macports-tickets@… new 12/13/13
#41817 CMake @2.8.12_2: remove /sw paths from installed cmake modules ports 2.2.1 defect css@… new 12/14/13
#41821 Tesseract description should indicate required steps post-install steps ports 2.2.1 defect emer@… new 12/15/13
#41825 openexr: configure failure on Mavericks ports 2.2.1 defect blair@… new 12/15/13
#41828 port 2.2.1 mpkg build fails after package has been created base 2.2.1 defect macports-tickets@… new 12/15/13
#41833 perl5.12 fails build due to make depend in subdirectory ports 2.2.1 defect macports-tickets@… new 12/16/13
#41839 gcr: build fails when using gtk3 +quartz due to X11 specific UI code ports 2.2.1 defect devans@… new 12/17/13
#41849 port 2.2.1: Error: org.macports.archivefetch for port libiconv returned: Failed to fetch signature for archive: The requested URL returned error: 400 Bad Request server/hosting 2.2.1 defect admin@… new 12/18/13
#41862 freetype: freetype-config differs and cannot be merged ports 2.2.1 defect ryandesign@… new 12/19/13
#41872 cyrus-sasl2 @2.1.26_3 +kerberos+sql+universal: muniversal destroot merge failure ports 2.2.1 defect macports-tickets@… new 12/21/13
#41873 lablgtk @1.2.7_4: build failure for gList.ml ports 2.2.1 defect macports-tickets@… new 12/21/13
#41875 slirp @1.0.17: ror: second parameter of 'main' (argument array) must be of type 'char **' ports 2.2.1 defect ryandesign@… assigned 12/21/13
#41876 maven-ant-tasks cannot find JAVA_HOME correctly ports 2.2.1 defect ieure@… new 12/21/13
#41880 Mavericks buildbot buildslave hangs fetching from git server/hosting defect skarulkar@… new 12/22/13
#41894 Build of autotrace 0.31.1_9 does not detect installed pstoedit ports 2.2.1 defect macports-tickets@… new 12/23/13
#41895 ghostscript @9.10: missing font packages ports 2.2.1 defect takanori@… new 12/23/13
#41917 libgcc-devel @4.9-20131215: internal compiler error: Illegal instruction ports 2.2.1 defect mww@… new 12/24/13
#41918 R @3.0.2_1: +atlas variant fails to build ports 2.2.1 defect kjell.konis@… new 12/24/13
#41924 v8 @3.23.15: build fails on lion buildslave and icu confusion ports 2.2.1 defect frodwith@… new 12/24/13
#41930 py-game: cannot initialize pygame screen ports 2.2.1 defect jmr@… new 12/25/13
#41937 Cacti port fails on Mavericks ports 2.2.1 defect macports-tickets@… new 12/26/13
#41948 libplist @1.10_0+python27: build error ports 2.2.1 defect macports-tickets@… new 12/27/13
#41950 libusb: no destroot found ports 2.2.1 defect rwilcox@… new 12/27/13
#41966 gnudatalanguage @0.9.4_3 +gshhs Runtime Error - PLplot installation lacks the requested driver: xwin ports 2.2.1 defect macports-tickets@… new 12/29/13
#41967 secpwgen @1.3_1 cryptlib error: -20 ports 2.2.1 defect macports-tickets@… new 12/29/13
#41972 latex2man @1.23: imprecise dependency on texlive ports 2.2.1 defect larryv@… assigned 12/30/13
#41976 upgrade for camlimages fails ports 2.2.1 defect reilles@… new 12/30/13
#41984 gtksourceview2 fails to build ports 2.2.1 defect micah.lerner@… new 12/31/13
#41995 db46 @4.6.21_9 update fails "build Command failed" ports 2.2.1 defect blair@… new 01/01/14
#42006 gpick: fatal error: 'libintl.h' file not found ports 2.2.1 defect macports-tickets@… new 01/03/14
#42008 cssed: ld: symbol(s) not found for architecture x86_64 ports 2.2.1 defect macports-tickets@… new 01/03/14
#42011 perl5.12: error: Availability.h: No such file or directory ports 2.2.1 defect macports-tickets@… new 01/03/14
#42014 gjs build failure ports 2.2.1 defect juanrgar@… new 01/03/14
#42029 qt4-mac: Undefined symbols _dbus_shutdown ports 2.2.1 defect michaelld@… new 01/05/14
#42030 alliance @5.0: error: incompatible type for argument 2 of 'chktab' ports 2.2.1 defect macports-tickets@… new 01/05/14
#42037 gnome-games: port outdated, replaced by new individual GNOME packages, maintainers wanted. ports 2.2.1 defect macports-tickets@… new 01/06/14
#42045 cgminer @3.9.0 knc varient causes compilation error ports 2.2.1 defect ram@… new 01/07/14
#42051 llvm-3.3: found python 2.3.5 (/usr/bin/python); required >= 2.5 ports 2.2.1 defect ryandesign@… new 01/07/14
#42055 freeradius @2.1.9_2 - Update overwrites all config files ports 2.2.1 defect macports-tickets@… new 01/08/14
#42061 mysql5: uses /usr/lib/libstdc++.6.dylib as C++ standard library although macports::cxx_stdlib is set to libc++ ports 2.2.1 defect ryandesign@… new 01/08/14
#42065 Squid runaway child processes at boot, commBind: Cannot bind socket FD NN to *:3128: (48) Address already in use ports 2.2.1 defect jmr@… new 01/08/14
#42070 lua @5.2.2_1 arrow keys don't work in interpreter ports 2.2.1 defect macports-tickets@… new 01/09/14
#42092 ghc-bootstrap does not build ports 2.2.1 defect kitchen.andy@… new 01/10/14
#42100 arpack 3.1.3_0+accelerate+gcc48+universal: i386 configure cannot find BLAS ports 2.2.1 defect mmoll@… new 01/11/14
#42101 upgrading qpdf attempts to link with old library ports 2.2.1 defect dojo@… new 01/12/14
#42102 py27-pip targets wrong python ports 2.2.1 defect stromnov@… new 01/12/14
#42105 fop and other java ports should check for JVM on activation ports 2.2.1 defect macports-tickets@… new 01/12/14
#42123 Cannot install Atlas ports 2.2.1 defect vince@… new 01/14/14
#42124 libcaca should not depend on port:imlib2 ports 2.2.1 defect macports-tickets@… new 01/14/14
#42125 Can't install traceroute ports 2.2.1 defect macports-tickets@… new 01/14/14
#42130 invalid command name "configure.cxx_stdlib" ports 2.2.1 defect macports-tickets@… new 01/14/14
#42149 mpeg4ip @1.5.0.1_3 does not compile on Mavericks ports 2.2.1 defect reid@… new 01/16/14
#42150 Aqua applications not compiling on Mavericks / Xcode 5.0.2 (ibtool error) ports 2.2.1 defect macports-tickets@… new 01/16/14
#42160 Installing Atlas Hangs ports 2.2.1 defect vince@… reopened 01/16/14
#42161 grass: compatibility with wxWidgets 3.0 ports defect macports-tickets@… new 01/17/14
#42163 Upgrade or install of libdynd fails ports 2.2.1 defect stromnov@… new 01/17/14
#42165 dialog @1.2-20130928+universal∞ Install failed during build ports 2.2.1 defect macports-tickets@… new 01/17/14
#42191 python*: IDLE requires py*-tkinter ports 2.2.1 defect jwa@… new 01/19/14
#42193 c2html @0.9.6 tries to skip destroot and install directly into prefix ports 2.2.1 defect macports-tickets@… reopened 01/19/14
#42194 Undefined symbols upgrading qpdf on Lion ports 2.2.1 defect dojo@… new 01/19/14
#42202 py-cython multiple upstream versions of Cython-9.20.tar.gz ports 2.2.1 defect macports-tickets@… new 01/20/14
#42220 py-netcdf4 @1.0.4_1: build failure when using ccache ports 2.2.1 defect macports-tickets@… new 01/21/14
#42225 qemu crashes in OpenSSL on Leopard/PPC ports 2.2.1 defect macports-tickets@… new 01/22/14
#42231 xtide @2.13.2_1: error: no type named 'initializer_list' in namespace 'std' ports 2.2.1 defect macports-tickets@… new 01/22/14
#42232 gdal @1.10.1_2 +expat +mrsid - patch failure - build failure ports 2.2.1 defect macports-tickets@… new 01/22/14
#42233 libraries compiled by the boost port with variant +python33 do not have match the symbols of regular builds ports 2.2.1 defect macports-tickets@… new 01/23/14
#42239 hnb @1.9.18_0 Segmentation fault 11 ports 2.2.1 defect css@… new 01/23/14
#42261 py27-backports-ssl_match_hostname install failure ports 2.2.99 defect stromnov@… new 01/26/14
#42264 airport fails to build on Mavericks ports 2.2.1 defect noses@… new 01/26/14
#42286 wxMaxima: greyed-out menu entries ports 2.2.1 defect usami-k@… new 01/27/14
#42289 librsvg @2.36.4_3 fails to update /opt/local/etc/gtk-2.0/gdk-pixbuf.loaders ports 2.2.1 defect pixilla@… new 01/27/14
#42294 toluapp @1.0.93_1 +universal: build failure ports 2.2.1 defect macports-tickets@… new 01/28/14
#42303 Use waf port group ports 2.2.1 defect macports-tickets@… new 01/28/14
#42320 py-bottleneck @0.8.0 unbuildable on small machines ports 2.2.1 defect stromnov@… new 01/29/14
#42331 crack-attack won't build/install on OS X Mavericks ports 2.2.1 defect raimue@… new 01/30/14
#42334 emacs @24.3_1+gtk+x11 error in g_spawn_sync() - emacs bug #8855 ports 2.2.1 defect dports@… new 01/30/14
#42336 heimdal @1.3.3_1 does not install (OS 10.9) ports 2.2.1 defect landonf@… new 01/31/14
#42348 graphviz @2.36.0 +ming: error: unknown type name 'textpara_t'; did you mean 'textspan_t'? ports 2.2.1 defect ryandesign@… assigned 02/01/14
#42351 subversion-javahlbindings @1.8.5_0+no_bdb: build failure ports 2.2.1 defect dluke@… assigned 02/01/14
#42353 iulib: error: default arguments cannot be added to a function template that has already been declared ports 2.2.1 defect macports-tickets@… new 02/02/14
#42361 libjpeg-turbo +universal: build failure ports 2.2.1 defect macports-tickets@… new 02/03/14
#42368 phantomjs @1.9.7_0 build error - undefined symbols for achitecture x86_64 ports 2.2.1 defect stromnov@… new 02/04/14
#42370 slib: build fails with texinfo 5 ports 2.2.1 defect macports-tickets@… new 02/04/14
#42375 i386-elf-gcc error while compiling: cannot find crt0.o ports 2.2.1 defect stepan@… new 02/05/14
Note: See TracReports for help on using and creating reports.