New Ticket     Tickets     Wiki     Browse Source     Timeline     Roadmap     Ticket Reports     Search

{1} Active Tickets (3732 matches)

  • List all active tickets by priority.
  • Color each row based on priority.

Results (1 - 100 of 3732)

1 2 3 4 5 6 7 8 9 10 11
Ticket Summary Component Version Milestone Type Owner Status Created
#39541 gimp2 @2.8.6_0 +help_browser +python27 +quartz build fails ports 2.1.3 defect devans@… assigned 06/26/13
#43254 gnucash: +python27 variant broken ports 2.2.99 defect dports@… assigned 04/06/14
#29153 gnome-doc-utils: python import error for libxml2 module ports 1.9.2 defect devans@… assigned 04/15/11
#39430 deluge @1.3.6 +python27: deluge-gtk-2.7 fails to start with "import error" ports 2.1.3 defect devans@… assigned 06/13/13
#41695 vim @7.4.052_0+huge+python27 build failure ports 2.2.1 defect raimue@… assigned 12/04/13
#43210 Missing error messages base 2.2.99 defect cal@… assigned 04/04/14
#24667 mysql5: mysql_install_db5: Installation of system tables failed! ports 1.8.2 defect ryandesign@… assigned 04/26/10
#27918 vim @7.3.94 +small does not compile (v7.3.94): ui.c error ports 1.9.2 defect raimue@… assigned 01/10/11
#34470 xgraph segmentation fault ports 2.1.0 defect ryandesign@… assigned 05/16/12
#39166 Squid crashes/restarts after assertion failed: store_swapout.cc:307: "mem->swapout.sio == self" ports 2.1.3 defect jmr@… assigned 05/20/13
#41248 bash @4.2.45_2 - Segmentation Fault when executing undefined command ports 2.2.1 defect raimue@… assigned 11/07/13
#41546 py33-psycopg2 +universal isn't universal ports 2.2.99 defect snc@… assigned 11/25/13
#42351 subversion-javahlbindings @1.8.5_0+no_bdb: build failure ports 2.2.1 defect dluke@… assigned 02/01/14
#43206 capnproto @0.4.1: Version mismatch between generated code and library headers. You must use the same version of the Cap'n Proto compiler and library. ports 2.2.99 defect cal@… assigned 04/03/14
#21853 mzscheme doesn't build under Snow Leopard ports 1.8.1 defect ryandesign@… assigned 10/05/09
#24479 kst-1.7.0 configure failure due to kde-config not found ports 1.8.2 defect macsforever2000@… assigned 04/14/10
#26265 coin +manpages failure renaming man pages ports 1.9.1 defect css@… assigned 08/27/10
#27802 emacs-app-devel @20091101 [bootstrap-emacs] Error 1 ports 1.9.2 defect css@… assigned 12/27/10
#31690 ardour2: can't find MIDI library and FFTW ports 2.0.3 defect devans@… assigned 10/20/11
#33919 gcc42 should be removed ports 2.0.4 defect jeremyhu@… assigned 04/06/12
#36950 Local Port Repo Instructions Should Address Permissions Issue guide defect larryv@… assigned 11/10/12
#39123 squid3: EUI error with 3.3.4 and OSX Server 10.6.8 ports 2.1.3 defect jmr@… assigned 05/16/13
#40478 gcc-4.8 (and likely earlier) build incorrectly +universal ports 2.2.0 defect jeremyhu@… assigned 09/14/13
#41092 ppc: clang-3.3: error: ‘memmove’ is not a member of ‘llvm::Intrinsic’ ports 2.2.1 defect jeremyhu@… assigned 10/30/13
#41318 cmake: Ignoring CMAKE_OSX_SYSROOT value because the directory does not exist ports 2.2.1 defect css@… assigned 11/11/13
#41542 gnome-system-monitor @3.8.2.1_0 - application crashes when the Resources tab is selected ports 2.2.1 defect devans@… assigned 11/25/13
#41874 Exempi patch causes python ctypes problem, relates to ticket 20965 ports 2.2.1 defect devans@… assigned 12/21/13
#42348 graphviz @2.36.0 +ming: error: unknown type name 'textpara_t'; did you mean 'textspan_t'? ports 2.2.1 defect ryandesign@… assigned 02/01/14
#42708 clang-3.3: build fails on SL: unknown load command ports 2.2.1 defect jeremyhu@… assigned 03/03/14
#42955 x264 @20140124_1 Build failure vs Xcode v5.1 (5B130a) ports 2.2.1 defect devans@… assigned 03/20/14
#20949 mysql5: mysql_upgrade5 expects 'mysql' instead of 'mysql5' ports 1.8.0 defect ryandesign@… assigned 08/31/09
#21314 sudo locks up Terminal.app until reboot ports 2.0.1 defect ged@… assigned 09/11/09
#22563 psi build failure on 10.6 64-bit ports 1.8.1 defect rowue@… assigned 11/16/09
#24460 gimp +quartz crashes - gtk errors ports 1.8.2 defect devans@… assigned 04/12/10
#25376 ghostview fails to open files ports 1.9.1 defect ryandesign@… assigned 06/22/10
#25868 parrot universal variant fails ports defect l2g@… assigned 07/29/10
#26398 dcraw: error while opening "/opt/local/share/locale/de/LC_MESSAGES/ufraw.mo" for reading: No such file or directory ports 1.9.1 defect ryandesign@… assigned 09/07/10
#27681 gajim-devel @0.12-alpha1-r10268 - fails to fetch ports 1.9.2 defect rene@… assigned 12/15/10
#31120 bitlbee @3.0.3 fails to build +universal ports 2.0.99 defect yeled@… assigned 09/05/11
#31441 glade3: Workaround for +quartz variant ports 2.0.3 defect devans@… assigned 09/28/11
#32340 xmms2 clang conf error with clang ports 2.0.3 defect ryandesign@… assigned 11/30/11
#33701 LyX spotlight plugin can't be loaded ports 2.0.4 defect snc@… assigned 03/20/12
#36041 gimp2: build fails on 10.5.8 PPC ports 2.1.2 defect devans@… assigned 09/07/12
#36704 gmp @5.0.5 +universal: build failure ports 2.1.2 defect mcalhoun@… assigned 10/23/12
#38691 libpng: nawk: illegal jump type 339 ports 2.1.3 defect ryandesign@… assigned 04/06/13
#39070 uzbl: uzbl-browser immediately aborts with a memory fault ports 2.1.3 defect ryandesign@… assigned 05/11/13
#40420 alienarena @7.53-20111227_1 received signal 11 ports 2.2.0 defect ryandesign@… assigned 09/09/13
#40465 9.9.3-P2_1 +dlz_mysql fails to build ports defect dluke@… assigned 09/12/13
#40567 HandBrake @0.9.8_0: build failure with Xcode 5 ports 2.2.0 defect larryv@… assigned 09/23/13
#40897 MacVim @7.4.snapshot71 +ruby18: Undefined symbols _rb_float_new_in_heap and _rb_str_new_cstr ports 2.2.0 defect raimue@… assigned 10/24/13
#41249 TeXShop3 @3.26: error: use of undeclared identifier 'NSActivityUserInitiatedAllowingIdleSystemSleep' ports 2.2.1 defect jwa@… assigned 11/07/13
#41281 hs-vector: activate failure ports 2.2.1 defect cal@… assigned 11/09/13
#41344 vim @7.4.052_0+breakindent+huge+python27+python33 - vim breaks with two Python versions ports 2.2.1 defect raimue@… assigned 11/12/13
#41378 Installing subversion-javahlbindings (1.8.4) fails on OS X 10.9 ports 2.2.1 defect dluke@… assigned 11/15/13
#41737 webkit-gtk is not supported for this installation of MacPorts. It requires libc++ be selected as your C++ runtime. Please use webkit-gtk-2.0 instead ports 2.2.1 defect ryandesign@… assigned 12/09/13
#41864 php52 @5.2.17_8+fastcgi: configure cannot find freetype.h ports 2.2.1 defect ryandesign@… assigned 12/20/13
#41875 slirp @1.0.17: ror: second parameter of 'main' (argument array) must be of type 'char **' ports 2.2.1 defect ryandesign@… assigned 12/21/13
#41972 latex2man @1.23: imprecise dependency on texlive ports 2.2.1 defect larryv@… assigned 12/30/13
#42408 pdftocairo (part of poppler) gives Bus Error: 10 ports 2.2.1 defect devans@… assigned 02/08/14
#42646 py27-flask-restful @0.2.11 ImportError due to missing dependency from aniso8601 ports 2.2.1 defect cal@… assigned 02/28/14
#42761 libvpx @1.3.0_1: build fails due to implicitly-defined function ports 2.2.1 defect devans@… assigned 03/07/14
#42876 Stack overflow in Gnucash when opening the Scheduled Transactions Editor ports 2.2.1 defect dports@… assigned 03/16/14
#19438 gimp2 2.6.6_0: Crash - Uncaught exception NSInvalidArgumentException was raised ports 1.7.1 defect devans@… assigned 04/26/09
#20492 php4, php5, php5-devel: php links with libldap if present ports 1.7.1 defect ryandesign@… assigned 07/30/09
#17455 mplayer doesn't build universal ports 1.6.0 defect ecronin@… assigned 11/30/08
#21166 Cannot compile and install net-snmp 5.4.2.1_1 from macports ports defect ryandesign@… assigned 09/06/09
#21871 php52 - depends on non-standard apache2 config ports 1.8.1 defect ryandesign@… assigned 10/05/09
#22167 nethack runs as root ports 1.8.1 defect yeled@… assigned 10/19/09
#19397 scipy not completely universal ports 1.7.1 defect larryv@… assigned 04/22/09
#23356 glade3 doesn't use the native Mac menu ports 1.8.2 defect devans@… assigned 01/20/10
#12659 unable to fire subtitle to a video via mencoder ports 1.6.0 defect ecronin@… assigned 09/09/07
#12429 port cannot handle spaces in various variables base 1.7.0 MacPorts Future defect larryv@… assigned 08/10/07
#14729 gnome installations do not register the schema files with gconf ports 1.6.0 defect reiffert@… assigned 03/20/08
#25466 mapm3 03.0, Revision 3, problem in calling int and log ports 1.9.1 defect ryandesign@… assigned 06/29/10
#12906 gcl package fails to build (reported upstream) ports 1.5.2 defect macports-tickets@… assigned 10/14/07
#26267 coin demo program has difficulty accessing ports 1.9.1 defect css@… assigned 08/28/10
#27575 gv: <F>, <B> keys don't work ports 1.9.2 defect ryandesign@… assigned 12/05/10
#27618 subversion links to previous install ports 1.9.2 defect dluke@… assigned 12/08/10
#39248 rb ports need revbump ports 2.1.3 defect kimuraw@… assigned 05/26/13
#29173 ld64 should symlink rather than copy ld and rebase on darwin > 10 ports 1.9.2 defect mfeiri@… assigned 04/16/11
#31205 tardiff: comparisons are inaccurate for tarballs which do not contain an enclosing parent folder ports 2.0.3 defect ryandesign@… assigned 09/10/11
#31231 xscorch: label at end of compound statement ports 2.0.3 defect ryandesign@… assigned 09/12/11
#31760 ports linking with ImageMagick need revbump ports 2.0.3 defect ryandesign@… assigned 10/25/11
#32065 ffmpeg @0.7.7 Undefined symbols for architecture x86_64 ports 2.0.3 defect devans@… assigned 11/14/11
#32575 llvm-3.{1,2}: fail to build with python3 selected ports 2.0.3 defect jeremyhu@… assigned 12/17/11
#32994 build of valgrind 3.7.0 on Leopard fails; gcc version not detected properly ports 2.0.3 defect raimue@… assigned 01/23/12
#34502 ogre@1.7.3 - pbxcp command execution failed, build failed. ports 2.1.0 defect marin@… assigned 05/18/12
#35635 MacVim: Bad font rendering ports 2.1.2 defect raimue@… assigned 08/12/12
#36355 vim: outdated runtime files ports 2.1.2 defect raimue@… assigned 09/27/12
#36366 xine-ui build fails with load.c:64:15: error: incomplete definition of type 'struct png_info_def' ports 2.1.2 defect ryandesign@… assigned 09/28/12
#37453 libsdl_image: unknown Graphical glitches and image non-display in SDL based games ports 2.1.2 defect jmr@… assigned 12/30/12
#37465 ImageSnap @0.2.5 PowerPC not supported ports 2.1.2 defect ryandesign@… assigned 12/31/12
#38822 nmap fails to compile, missing "#include <sys/types.h>" ports 2.1.3 defect dluke@… assigned 04/16/13
#39011 libxfce4menu @ 4.6.2 does not load libgobject symbols ports 2.1.3 defect afb@… assigned 05/05/13
#39745 xsel missing dependency ports 2.1.3 defect ryandesign@… assigned 07/15/13
#40246 jabber @1.4.2_5 (net) command execution failed ports 2.2.0 defect ryandesign@… assigned 08/25/13
#15678 mysql_install_db5 failed ports 1.6.0 defect ryandesign@… assigned 06/19/08
#40423 luarocks @2.0.13_2 is broken when Lua 5.1 is installed ports 2.2.0 defect and.damore@… assigned 09/09/13
#43321 py-scipy @0.13.3_1: builds agains ATLAS (variant +atlas) Seg. fault during testing. ports defect sean@… assigned 04/11/14
#43283 gtk3 @3.12.0 +quartz build fails on OS X 10.6.8 ports 2.2.1 defect cal@… assigned 04/07/14
1 2 3 4 5 6 7 8 9 10 11
Note: See TracReports for help on using and creating reports.