New Ticket     Tickets     Wiki     Browse Source     Timeline     Roadmap     Ticket Reports     Search

{1} Active Tickets (3720 matches)

  • List all active tickets by priority.
  • Color each row based on priority.

Results (901 - 1000 of 3720)

1 2 3 4 5 6 7 8 9 10 11 12 13 14 15 16 17 18 19 20
Ticket Summary Component Version Milestone Type Owner Status Created
#35895 pidgin-encryption: add pkgconfig dependency and license ports 2.1.2 defect rsync@… new 08/29/12
#35899 p5.12-net-cups @0.610.0, Revision 2 (perl), 'cups/image.h' file not found, build failure ports 2.1.2 defect clot@… new 08/30/12
#35930 xmms2d uses 100% cpu when dnssd related components are active ports 2.1.2 defect macports-tickets@… new 09/02/12
#35931 mysql5-connector-cpp @1.1.1: post-destroot failed to change install_name ports 2.1.2 defect pixilla@… new 09/02/12
#35959 twain-sane @3.0 can't be found by apps ports 2.1.2 defect macports-tickets@… new 09/04/12
#35960 sane-backends library exits with signal 11 ports 2.1.2 defect aguynamedryan+sane@… new 09/04/12
#35972 inform @6.31.1 build fails with clang (missing verblibm.h and parserm.h) ports 2.1.2 defect vim@… new 09/04/12
#35997 gtk-nodoka-engine (and others) need rev bump ports 2.1.2 defect macports-tickets@… new 09/05/12
#35998 icns-gimp needs revision bump (libpng) ports 2.1.2 defect macports-tickets@… new 09/05/12
#36029 gcc47 @4.7.1_2: error: conflicting declaration 'typedef enum pointer_t pointer_t' ports 2.1.2 defect mww@… new 09/07/12
#36041 gimp2: build fails on 10.5.8 PPC ports 2.1.2 defect devans@… assigned 09/07/12
#36049 pango +quartz: cairo backend is unusable ports 2.1.2 defect ryandesign@… new 09/08/12
#36088 Directories created in FUSE FS do not have read and write permissions to user - e.g. 0155, instant of 0755 ports 2.1.2 defect dports@… new 09/10/12
#36092 PDFTK broken after GCC47 upgrade ports 2.1.2 defect ryandesign@… new 09/10/12
#36101 apache2 @2.2.22_2 startup item ports 2.1.2 defect ryandesign@… new 09/11/12
#36107 py27-lxml broken with python27 +ucs4 ports 2.1.2 defect akitada@… new 09/11/12
#36109 libxml2 2.8.0 breaks postgis2 2.0.1 ports 2.1.2 defect macports-tickets@… reopened 09/12/12
#36128 postgresql_select @0.1 does not configure pg_upgrade when selecting postgresql92 ports 2.1.2 defect mww@… new 09/13/12
#36132 playerstage-player: Undefined symbols: __playerc_client_t_set_transport etc ports 2.1.2 defect vincent@… new 09/13/12
#36134 py26-mapnik @0.7.1_6+cairo+gdal+postgis+sqlite Build Failure ports 2.1.2 defect dbsgeo@… new 09/13/12
#36149 tar: Failed to set default locale ports 2.1.2 defect macports-tickets@… new 09/14/12
#36165 lprof: fatal error: 'xspect.h' file not found ports 2.1.2 defect macports-tickets@… new 09/15/12
#36176 plplot upgrade to rev 3 fails, claims clang not installed ports 2.1.2 defect takeshi@… new 09/17/12
#36182 gimp2 compilation error ports 2.1.2 defect devans@… new 09/17/12
#36194 hellanzb doesn't start (Snow Leopard 10.6.8) - previous fix not worling ports 2.1.2 defect pjenvey@… new 09/17/12
#36196 xemacs crashes after port update ports 2.1.2 defect macports-tickets@… new 09/17/12
#36198 t4k_common 0.1.1_1 - build error ports 2.1.2 defect davidstuartbruce@… new 09/17/12
#36204 gcc47 empty string issue ports 2.1.2 defect macports-tickets@… new 09/18/12
#36208 mysqlhotcopy script does not work properly with MacPorts installations ports 2.1.2 defect ryandesign@… new 09/18/12
#36211 ccache: FATAL: Failed to create /opt/local/var/macports/build/.ccache/6/3: Permission denied base 2.1.2 defect macports-tickets@… new 09/18/12
#36215 perl5.12: AutoSplit.pm did not return a true value at Install.pm line 6 ports 2.1.2 defect macports-tickets@… new 09/18/12
#36217 Gimp 2.8.2 sees return of xsane problem ports 2.1.2 defect devans@… new 09/19/12
#36249 magic-exttools: compile fails with clang; activation fails ports 2.1.2 defect macports-tickets@… new 09/20/12
#36251 magic: Symbol not found: _DBTechName, Referenced from: exttosim.dylib ports 2.1.2 defect macports-tickets@… new 09/20/12
#36252 eiffelstudio71 @7.1.88986 build error - build failure ports 2.1.2 defect jann@… new 09/20/12
#36269 py27-httplib2 fails to upgrade ports 2.1.2 defect macports-tickets@… new 09/21/12
#36277 livechecks of various ports are broken ports 2.1.2 defect macports-tickets@… new 09/21/12
#36279 hg-forest: No module named repo ports 2.1.2 defect macports-tickets@… new 09/21/12
#36282 mediatomb: compilation error with latest mp4v2 ports 2.1.2 defect yattenator@… new 09/22/12
#36296 OS X Mountain Lion has no /var/log/secure.log for sshguard to read ports 2.1.2 defect nefar@… new 09/23/12
#36298 HandBrake: mkdir: /usr/X11/var: Permission denied ports 2.1.2 defect macports-tickets@… new 09/23/12
#36301 py26-mysql package exists but its rmd160 file does not server/hosting 2.1.2 defect admin@… new 09/24/12
#36324 gtk2 @2.24.12 build failure: ld crash: pointer being freed was not allocated ports 2.1.2 defect macports-tickets@… new 09/25/12
#36355 vim: outdated runtime files ports 2.1.2 defect raimue@… assigned 09/27/12
#36366 xine-ui build fails with load.c:64:15: error: incomplete definition of type 'struct png_info_def' ports 2.1.2 defect ryandesign@… assigned 09/28/12
#36369 squeak port will not install ports 2.1.2 defect macports-tickets@… new 09/28/12
#36389 /var/folders/.../T//ccD2wTc5.s:63:no such instruction: `vmovss 0(%rbp), %xmm0' ports 2.1.2 defect mww@… new 09/30/12
#36408 mercury @11.01: error: thread-local storage is unsupported for the current target ports 2.1.2 defect macports-tickets@… new 09/30/12
#36421 gq @ 1.2.1 build failure ports 2.1.2 defect syzdek@… new 10/02/12
#36431 qt4-mac: macdeployqt shows errors when trying to copy in frameworks ports 2.1.2 defect michaelld@… new 10/02/12
#36435 swig-octave: mkoctfile... configure: error: mkoctfile is not installed ports 2.1.2 defect kevin@… new 10/02/12
#36441 port splash: build failed ports 2.1.2 defect daniel.price@… new 10/03/12
#36452 port select python version not updating all PATH's ports 2.1.2 defect macports-tickets@… new 10/03/12
#36474 arb is not UsingTheRightCompiler for PERL2ARB ports 2.1.2 defect matt.cottrell@… new 10/04/12
#36477 transmission-x11 Unable to install transmission-x11 on Mountain Lion ports 2.1.2 defect macports-tickets@… new 10/04/12
#36480 kerberos5: error: expected declaration specifiers before ‘__AVAILABILITY_INTERNAL__MAC_10_0_DEP__MAC_10_8’ ports 2.1.2 defect macports-tickets@… new 10/05/12
#36497 qt4-mac @4.8.3_1 +quartz Unable to build on Tiger ports 2.1.2 defect michaelld@… new 10/06/12
#36506 cadabra +universal fails because dependency LiE is not universal ports 2.1.2 defect gwright@… new 10/07/12
#36511 postgresq??: rename python variant to python27 ports 2.1.2 defect mww@… new 10/07/12
#36520 rb-rails: doesn't install rails ports 2.1.2 defect rcavanaugh@… new 10/08/12
#36522 commons-daemon java 1.7 mountain lion fails ports 2.1.2 defect macports-tickets@… new 10/08/12
#36525 Problem with connecting to https hosts. ports 2.1.2 defect mww@… new 10/08/12
#36526 docbook-xml-5.0 deactivate errors ports 2.1.99 defect lockhart@… new 10/08/12
#36538 libdc1394: bump to 2.2.0 + apply patch for buggy OSX firewire stack ports 2.1.2 defect mail@… new 10/09/12
#36542 ktorrent @3.3.4: error: reference to 'TorrentInterface' is ambiguous ports 2.1.2 defect macports-tickets@… new 10/09/12
#36543 Quagga @0.99.16_0 build fails on 10.8 ports 2.1.2 defect mike@… new 10/09/12
#36551 openmotif @2.3.3 -- Undefined symbols for architecture x86_64: "_main" ports 2.1.2 defect macports-tickets@… new 10/09/12
#36553 libgnomecanvas-2.30.3_3 can't resolve dependency libart-2.0 ports 2.1.2 defect macports-tickets@… new 10/10/12
#36554 zmq +pgm fails to build on 10.8.2 ports 2.1.2 defect merijn@… new 10/10/12
#36561 gst-rtsp-server @0.10.8_0 Build failure due to gobject-introspection being disabled in gstreamer ports 2.1.2 defect rmstonecipher@… new 10/10/12
#36567 libgeier @0.13 Processing of port libgeier failed ports 2.1.2 defect macports-tickets@… new 10/11/12
#36582 Io @2011.09.12 (lang) Port Reported as Broken ports 2.1.2 defect macports-tickets@… new 10/13/12
#36612 path:-style dep allows non-macports file inside macports prefix base 2.1.99 defect macports-tickets@… new 10/15/12
#36613 py27-tz and py27-tz-gae have a conflicting file ports 2.1.2 defect ram@… new 10/15/12
#36646 groovy @2.0.5: gradle-1.2-bin.zip.part (No such file or directory) ports 2.1.2 defect breskeby@… new 10/18/12
#36657 p5-app-ack @1.960.0 provides no man page ports 2.1.2 defect mschout@… new 10/19/12
#36667 HandBrake: Undefined symbols _libiconv_close _libiconv _libiconv_open ports 2.1.2 defect macports-tickets@… new 10/19/12
#36672 netatalk: fatal error: 'netat/appletalk.h' file not found ports 2.1.2 defect ralph@… new 10/20/12
#36674 netatalk: error: incomplete definition of type 'struct _ipp_s' ports 2.1.2 defect ralph@… new 10/20/12
#36682 ksh93; typeset does not localize shell variable inside function ports 2.1.2 defect macports-tickets@… new 10/21/12
#36686 gearmand @0.41_0+sqlite requires compiler specification on a 10.5.8 PPC ports 2.1.2 defect macports-tickets@… new 10/22/12
#36696 py27-scikits-learn: Missing ATLAS symbol on sklearn.cluster import ports 2.1.2 defect stromnov@… new 10/23/12
#36697 py32-scikits-image: build fails ports 2.1.2 defect stromnov@… new 10/23/12
#36704 gmp @5.0.5 +universal: build failure ports 2.1.2 defect mcalhoun@… assigned 10/23/12
#36705 youtube-dl should have ffmpeg as dependency ports 2.1.2 defect ryandesign@… new 10/23/12
#36707 graphviz +smyrna fails when gtk2 is installed +quartz -x11 ports 2.1.2 defect ryandesign@… new 10/23/12
#36708 stuck on Configuring vis5d ports 2.1.2 defect takeshi@… new 10/23/12
#36716 p5.12-locale-gettext: gettext function not found ports 2.1.2 defect l2g@… new 10/24/12
#36727 gdb 7.5 BFD unknown load command & Unable to find Mach task port ports 2.1.2 defect dweber@… new 10/25/12
#36735 Macports pythons 2.5, 2.6, 2.7 do file-globbing as if a UNIX shell instead of tabbing ports 2.1.2 defect jwa@… new 10/25/12
#36747 phantomjs @1.7.0_0 build error - g++ unrecognised option `-fconstant-cfstrings` ports 2.1.2 defect macports-tickets@… new 10/26/12
#36748 ext2fuse: mounted filesystem not readable (PPC or 32bit issue?) ports 2.1.2 defect macports-tickets@… new 10/26/12
#36749 kdelibs4 doesn't respect startupitem ports 2.1.2 defect nicos@… reopened 10/26/12
#36770 Need for a fix regarding mechanism for startupitem handling base 2.1.2 defect macports-tickets@… new 10/28/12
#36782 cyrus-sasl2: ./makemd5: Bad CPU type in executable ports 2.1.2 defect jmpp@… new 10/28/12
#36792 JAVA_HOME lost when building tomcat6 on Mountain Lion ports 2.1.2 defect blair@… new 10/29/12
#36799 libgksuui10: universal variant fails to build ports 2.1.2 defect macports-tickets@… new 10/29/12
#36802 GDB won't "step in" (s) ports 2.1.2 defect dweber@… new 10/29/12
#36806 torsocks installs documentation in the wrong directory ports 2.1.2 defect sami.laine@… new 10/29/12
#36842 minicom crash when a zmodem transfer ends ports 2.1.2 defect macports-tickets@… new 10/31/12
1 2 3 4 5 6 7 8 9 10 11 12 13 14 15 16 17 18 19 20
Note: See TracReports for help on using and creating reports.