New Ticket     Tickets     Wiki     Browse Source     Timeline     Roadmap     Ticket Reports     Search

{2} Active Tickets by Version (4173 matches)

This report shows how to color results by priority, while grouping results by version.

Last modification time, description and reporter are included as hidden fields for useful RSS export.

Results (2301 - 2400 of 4173)

2.1.2 (8 matches)

Ticket Summary Component Version Type Owner Status Created
#37744 sshfs-gui: MacFUSE no longer maintained, replaced by OSXFUSE? ports 2.1.2 update macports-tickets@… new 01/22/13
#37773 vislcg3 update to 0.9.8.8406 ports 2.1.2 update macports-tickets@… new 01/24/13
#37803 texstudio @2.5.2 - port file for new version ports 2.1.2 update ryandesign@… assigned 01/27/13
#36827 mythtv-core.25 00.25.2-Fixes-20120918 mythfrontend.app does not exit properly ports 2.1.2 defect ctreleaven@… new 10/30/12
#37256 gobject-introspection: building non-universal i386 fails when python27 is installed universal i386 x86_64 ports 2.1.2 defect macports-tickets@… new 12/09/12
#37864 boost doc: missing pictures ports 2.1.2 defect macports-tickets@… new 01/31/13
#37867 Weird library install_names for MacPorts dylibs base 2.1.2 defect macports-tickets@… new 01/31/13
#37281 openssl: purify variant ports 2.1.2 enhancement larryv@… new 12/11/12

2.1.3 (92 matches)

Ticket Summary Component Version Type Owner Status Created
#38452 Information disclosure vulnerability with apache2 and other web servers ports 2.1.3 defect macports-tickets@… new 03/20/13
#39248 rb ports need revbump ports 2.1.3 defect kimuraw@… assigned 05/26/13
#37939 dia: docbook.xsl:1: parser error : Document is empty ports 2.1.3 defect macports-tickets@… new 02/04/13
#37947 graphite2 fails to build with libc++ ports 2.1.3 defect ryandesign@… new 02/04/13
#37958 Packaging vpnc failed ports 2.1.3 defect macports-tickets@… new 02/06/13
#37990 python27 @2.7.3_1 SysLogHandler uses wrong default address for syslog ports 2.1.3 defect jwa@… new 02/08/13
#37998 jasper should not install its config.h ports 2.1.3 defect jmr@… new 02/09/13
#38000 ntop @5.0.1 fails to build on 10.5 ppc ports 2.1.3 defect macports-tickets@… new 02/09/13
#38005 wireshark doesn't build without libpng ports 2.1.3 defect opendarwin.org@… reopened 02/09/13
#38030 python 2.7.3 and py27-tkinter - idle.py segfaults ports 2.1.3 defect jwa@… new 02/11/13
#38037 iulib is not UsingTheRightCompiler or -arch flags ports 2.1.3 defect macports-tickets@… new 02/12/13
#38059 Broken Krusader "krusader.shell" ports 2.1.3 defect macports-tickets@… new 02/14/13
#38063 gimp2 2.8.4 build failure on OSX 10.6 ports 2.1.3 defect devans@… new 02/14/13
#38069 gimp @2.8.4 +animation Brush outline not showing ports 2.1.3 defect devans@… new 02/14/13
#38082 pdftk encounters fatal malloc problem ports 2.1.3 defect ryandesign@… new 02/16/13
#38086 fragrouter @1.6: build failure ports 2.1.3 defect macports-tickets@… new 02/16/13
#38105 argyll @1.3.2_2: cannot link to tiff ports 2.1.3 defect macports-tickets@… new 02/18/13
#38109 Memory Issue when using Kile ports 2.1.3 defect nicos@… new 02/18/13
#38113 gnu-classpath @0.99: configure fails: error: cannot determine a size for void * ports 2.1.3 defect macports-tickets@… new 02/18/13
#38118 httperf segaults ports 2.1.3 defect macports-tickets@… new 02/18/13
#38133 android-ndk @7b_0: build failure on OS X 10.5.8 PPC ports 2.1.3 defect krischik@… new 02/20/13
#38135 mipsel-linux-binutils @2.16.1 Executables not linked into ${prefix}/bin ports 2.1.3 defect macports-tickets@… new 02/20/13
#38153 py27-gitpython missing runtime dependency on py27-gitdb ports 2.1.3 defect landonf@… new 02/21/13
#38168 Conflicting declarations in tiff and opencv ports 2.1.3 defect stromnov@… new 02/22/13
#38182 tcLex @1.2a1 build failure: missing header: <tclInt.h> ports 2.1.3 defect macports-tickets@… new 02/23/13
#38183 ccache @3.1.9 "c++" uses the wrong compiler ports 2.1.3 defect landonf@… new 02/23/13
#38188 expat @2.1.0_0: archivefetch failure ports 2.1.3 defect ryandesign@… new 02/24/13
#38200 Error when compiling alpine +passfile ports 2.1.3 defect macports-tickets@… reopened 02/25/13
#38222 akregator crashing at start up ports 2.1.3 defect nicos@… new 02/27/13
#38223 eiffelstudio72 is not UsingTheRightCompiler ports 2.1.3 defect jann@… new 02/27/13
#38229 birdfont: LSOpenURLsWithRole() failed with error -10810 for the file /Applications/MacPorts/BirdFont.app. ports 2.1.3 defect johan.mattsson@… new 02/27/13
#38235 R documentation is missing ports 2.1.3 defect kjell.konis@… new 02/28/13
#38238 tktable: build fails on Mountain Lion, error: incomplete definition of type 'struct _XDisplay' ports 2.1.3 defect macports-tickets@… new 02/28/13
#38262 sbcl @1.1.5: build failure ports 2.1.3 defect easieste@… new 03/02/13
#38263 Tiled @0.9.0 crashes on startup ports 2.1.3 defect macports-tickets@… new 03/03/13
#38268 tcl/tk 8.6 breaks apbs_tools.py in pymol ports 2.1.3 defect macports-tickets@… new 03/03/13
#38301 Latest Ocropus doesn't get along with iulib ports 2.1.3 defect macports-tickets@… new 03/05/13
#38304 i386-mingw32-binutils @2.21-3_0: windres converts resource string to UTF-16 with wrong endianness, PATCH ports 2.1.3 defect landonf@… new 03/05/13
#38311 libstdcxx +universal configure failure ports 2.1.3 defect mww@… new 03/06/13
#38335 redland-bindings: missing dependency ports 2.1.3 defect macports-tickets@… new 03/08/13
#38338 Pdftk @1.44 +gcc45 crashes by default ports 2.1.3 defect ryandesign@… new 03/09/13
#38345 gnupod: fix variants ports 2.1.3 defect macports-tickets@… new 03/09/13
#38352 amarok @2.6.0 Build fails (testamazonalbum) ports 2.1.3 defect macports-tickets@… new 03/10/13
#38354 Install latest kmymoney4 guide 2.1.3 defect macports-tickets@… new 03/10/13
#38364 virtualbox: SyntaxError: invalid syntax ports 2.1.3 defect macports-tickets@… new 03/12/13
#38385 xsltproc: xsl:import : unable to load urn:docbkx:stylesheet ports 2.1.3 defect macports-tickets@… new 03/14/13
#38416 amarok-devel: configure failure (Qt qmake not found!) ports 2.1.3 defect macports-tickets@… new 03/17/13
#38425 dvdisaster: build failure OS X 10.5.8 G4 PPC ports 2.1.3 defect michael.klein@… new 03/18/13
#38430 opencv: error: dispatch/dispatch.h: No such file or directory ports 2.1.3 defect stromnov@… new 03/18/13
#38483 frozenbubble2: build for the right architectures ports 2.1.3 defect macports-tickets@… new 03/21/13
#38488 bali-phy: Error: I can't find <boost/filesystem/operations.hpp> ports 2.1.3 defect ryandesign@… new 03/22/13
#38493 rethinkdb: error: thread-local storage is unsupported for the current target ports 2.1.3 defect macports-tickets@… new 03/22/13
#38494 cassandra can't write to its database directory ports 2.1.3 defect macports-tickets@… new 03/22/13
#38496 org-mode-devel installs files in ${prefix}/emacs ports 2.1.3 defect macports-tickets@… new 03/22/13
#38513 maloc @1.5: make documentation into a variant ports 2.1.3 defect macports-tickets@… new 03/23/13
#38515 monotone @1.0.0 build failure ports 2.1.3 defect macports-tickets@… new 03/24/13
#38519 blitz-devel @0.10-20110812_1: build failure ports 2.1.3 defect andre.dos.anjos@… new 03/24/13
#38525 poppler @0.22.2: fix conflict between docs and universal variant ports 2.1.3 defect devans@… new 03/25/13
#38547 supertuxkart: fatal error: 'AGL/gl.h' file not found ports 2.1.3 defect macports-tickets@… new 03/26/13
#38548 qtmobility does not compile ports 2.1.3 defect macports-tickets@… new 03/26/13
#38551 gcc48: "ar" does not work (complains about missing 'liblto_plugin.so') ports 2.1.3 defect mww@… new 03/26/13
#38558 VirtualBox @4.2.10 build fails when poll-emulator @1.5.1 is active ports 2.1.3 defect macports-tickets@… new 03/26/13
#38560 opencv +python27: cannot import Python module ports 2.1.3 defect macports-tickets@… new 03/27/13
#38561 openssl @1.0.1_1 build failure on Tiger (again) no-asm for Dawin 8? ports 2.1.3 defect larryv@… new 03/27/13
#38566 rawstudio: error: gdk/gdkx.h: No such file or directory ports 2.1.3 defect macports-tickets@… new 03/28/13
#38586 atlas @3.10.1_3: log file contents missing when -k option used base 2.1.3 defect macports-tickets@… new 03/29/13
#38617 gtk2: pkg-config --libs gtk+-2.0 does not include -lgmodule-2.0 ports 2.1.3 defect macports-tickets@… new 04/01/13
#38624 Ogre build fails ports 2.1.3 defect marin.saric@… new 04/01/13
#38627 oracle-instantclient: not available on ppc machines ports 2.1.3 defect ryandesign@… new 04/01/13
#38629 openldap: clang: error: no input files ports 2.1.3 defect landonf@… new 04/01/13
#38639 samba4 fails to build ports 2.1.3 defect mww@… new 04/02/13
#38697 mdmg says it's up-to-date when it isn't base 2.1.3 defect macports-tickets@… new 04/06/13
#38709 maxima @5.28.0_3+xmaxima binary package is inevitably obsolete ports 2.1.3 defect macports-tickets@… new 04/07/13
#38710 elinks-devel: +gnutls variant build fails ports 2.1.3 defect macports-tickets@… new 04/07/13
#38715 unittest-cpp fails to build ports 2.1.3 defect macports-tickets@… new 04/08/13
#38716 stp fails to build ports 2.1.3 defect macports-tickets@… new 04/08/13
#38746 no action from MacPorts IDLE ports 2.1.3 defect jwa@… new 04/10/13
#38753 metapixel 1.0.2_3 does not build with libpng 1.5 ports 2.1.3 defect fclaire@… new 04/10/13
#38789 totem fails to build on a case-sensitive filesystem ports 2.1.3 defect devans@… new 04/13/13
#38793 gmime @2.6.15_0 build failure due to missing dependency ports 2.1.3 defect macports-tickets@… new 04/13/13
#38810 Build of xfig fails in 32 bit Macports environment ports 2.1.3 defect macports-tickets@… new 04/14/13
#38825 gtkglextmm @1.2.0: fix underquoted macro warning ports 2.1.3 defect billitch@… new 04/16/13
#38838 Cannot add .qch files to QtCreator ports 2.1.3 defect macports-tickets@… new 04/17/13
#38878 gettext: Use macports libtool and thus support compilation against libc++ ports 2.1.3 defect ryandesign@… new 04/21/13
#38885 cufflinks @ 0.9.3: build fails ports 2.1.3 defect haroldpimentel@… new 04/22/13
#38910 pear-PHPUnit @3.6.11: configure error ports 2.1.3 defect macports-tickets@… new 04/24/13
#38911 Error Building Nu ports 2.1.3 defect macports-tickets@… new 04/24/13
#38942 zlib @1.2.8: mpkg failure ports 2.1.3 defect ryandesign@… new 04/26/13
#38948 Cannot use port select bpython with bpython_select ports 2.1.3 defect macports-tickets@… new 04/27/13
#38951 rdesktop +smartcard: Undefined symbols: "_SCARD_CTL_CODE" ports 2.1.3 defect cshbell@… new 04/28/13
#38958 R @3.0.0_0: build failure on OS X 10.6.8 ports 2.1.3 defect kjell.konis@… new 04/28/13
#38969 cufflinks @0.9.3 - build failure ports 2.1.3 defect haroldpimentel@… new 04/30/13
Note: See TracReports for help on using and creating reports.