{4} Assigned, Active Tickets by Owner (1500 matches)

List assigned tickets, group by ticket owner, sorted by priority.

Results (1 - 100 of 1500)

1 2 3 4 5 6 7 8 9 10 11

0x6772 (2 matches)

Ticket Summary Component Milestone Type Created
#48948 abcde @2.7: Can't locate MusicBrainz/DiscID.pm in @INC ports defect Sep 22, 2015
#49799 abcde @ 2.7 disk reading error ports defect Nov 24, 2015

admin@… (10 matches)

Ticket Summary Component Milestone Type Created
#40190 Trac wiki page deleted messages are not correct trac defect Aug 20, 2013
#19250 Modify SVN-Notify to add additional links into repository from the commit email server/hosting enhancement Apr 9, 2009
#31443 Trac: Report on all the tickets on which someone added a comment or attachment trac enhancement Sep 28, 2011
#38095 RFE: Automatically check tickets for common mistakes before allowing users to submit them server/hosting enhancement Feb 17, 2013
#44700 Request: download-friendly installer package URLs server/hosting enhancement Aug 19, 2014
#44789 Remove .html files from distfiles mirrors server/hosting enhancement Aug 27, 2014
#51995 buildbot improvements buildbot/mpbb enhancement Aug 10, 2016
#51996 Buildbot: create a new factory to aid with new MacPort releases buildbot/mpbb enhancement Aug 10, 2016
#18952 Stray .TMP files on distfiles mirrors server/hosting defect Mar 24, 2009
#52107 Trac: options to temporarily disable emails on tickets that affect many maintainers and commits trac enhancement Aug 26, 2016

agraef (1 match)

Ticket Summary Component Milestone Type Created
#59898 pure-octave: why are we setting -std=gnu++11? ports defect Dec 28, 2019

aivazis (1 match)

Ticket Summary Component Milestone Type Created
#60597 openmpi @4.0.1_1: openmpi-clangXX - the list of variants doesn't mention clang ports defect Jun 4, 2020

alexander.afanasyev@… (1 match)

Ticket Summary Component Milestone Type Created
#55796 py27-goocanvas @0.14.1_6: Failed to destroot py27-goocanvas: command execution failed ports defect Feb 6, 2018

amake (3 matches)

Ticket Summary Component Milestone Type Created
#43992 Platypus: error: use of undeclared identifier 'CGDirectPaletteRef' ports defect Jun 11, 2014
#57516 py-pyscard @1.9.7: error: ‘SCARD_PROTOCOL_UNDEFINED’ undeclared ports defect Nov 6, 2018
#58501 Gradle-5.4.1 does not even start ports defect May 20, 2019

anddam (1 match)

Ticket Summary Component Milestone Type Created
#40423 luarocks @2.0.13_2 is broken when Lua 5.1 is installed ports defect Sep 9, 2013

aphor (1 match)

Ticket Summary Component Milestone Type Created
#59355 haproxy @1.9.6: error: use of undeclared identifier 'CLOCK_MONOTONIC' ports defect Oct 16, 2019

aquynh (1 match)

Ticket Summary Component Milestone Type Created
#58624 Capstone Fails To Install On Mac OSX 10.5 Leopard PPC ports defect Jun 19, 2019

arjanvandervelde (2 matches)

Ticket Summary Component Milestone Type Created
#58568 poco @1.8.0.1: Don't look for files in /usr/local/opt/openssl/include ports defect Jun 7, 2019
#60129 poco, where are the cmake files ports defect Feb 25, 2020

arjunsalyan (1 match)

Ticket Summary Component Milestone Type Created
#59991 ports.macports.org: exact matches are not always included in search results website defect Jan 20, 2020

bardeau (5 matches)

Ticket Summary Component Milestone Type Created
#51726 Gildas Install Fail ports defect Jun 28, 2016
#56739 gildas fails to install due to unexpected token ports defect Jun 25, 2018
#59347 gildas @201910b build failure: ld: framework not found CoreFoundation ports defect Oct 16, 2019
#59753 gildas @201911b: does not build for the right C++ stdlib (undefined symbols) ports defect Nov 24, 2019
#60701 gildas: Undefined symbols: _main ports defect Jun 23, 2020

beauby (1 match)

Ticket Summary Component Milestone Type Created
#57420 libfaiss: fatal error: malloc.h: No such file or directory ports defect Oct 21, 2018

bjoern.ricks@… (1 match)

Ticket Summary Component Milestone Type Created
#60808 kdepim4: KDE windows (kalarm) -- un-switchable-to, un-clickable (unpredictably) ports defect Jul 9, 2020

blair (2 matches)

Ticket Summary Component Milestone Type Created
#60170 coreutils 8.32: rm -i z core dumps ports defect Mar 9, 2020
#60617 scala-migrations: update to 1.1.1 ports update Jun 8, 2020

breun (2 matches)

Ticket Summary Component Milestone Type Created
#57677 openjdk11 install finds broken files after multiple install attempts ports defect Nov 25, 2018
#60634 skaffold: usage: mktemp [-d] [-q] [-t prefix] [-u] template ... ports defect Jun 12, 2020

casouri (1 match)

Ticket Summary Component Milestone Type Created
#60682 v2ray overrides the build phase ports defect Jun 19, 2020

cfaerber (1 match)

Ticket Summary Component Milestone Type Created
#58951 wml 2.0.11_14 will not build ports defect Sep 7, 2019

chadcatlett (1 match)

Ticket Summary Component Milestone Type Created
#60604 exa links with libiconv but doesn't declare a dependency on it ports defect Jun 6, 2020

chris@… (3 matches)

Ticket Summary Component Milestone Type Created
#59143 wolfssl: Update to 4.1.0 ports defect Oct 2, 2019
#59144 wolfssl @3.15.3 +universal: inline assembly requires more registers than available ports defect Oct 2, 2019
#59145 wolfssl: Disable silent rules ports defect Oct 2, 2019

chrstphrchvz (1 match)

Ticket Summary Component Milestone Type Created
#43463 p5-tk: nonfunctional bindings with libpng ports defect Apr 22, 2014

ci42 (26 matches)

Ticket Summary Component Milestone Type Created
#54426 couchdb 1.6.1: couchdb no longer starts ports defect Jul 5, 2017
#56261 erlang: file not found: /opt/local/lib/libcrypto.1.0.0.dylib ports defect Apr 10, 2018
#56394 erlang fails to build with libressl-devel 2.7.2 ports defect May 1, 2018
#57787 go-tools installs a binary called 'bundle' that conflicts with the Ruby gem of the same name ports defect Dec 17, 2018
#58192 Current Go port fails to compile yubihsm-connector package ports defect Mar 12, 2019
#58486 go-tools @d1a3278ee74994e9aa609e9e711c616bba677d5d fails to build on mavericks ports defect May 17, 2019
#58592 go @1.12.5: Undefined symbols _fstatat64 _openat _unlinkat ports defect Jun 12, 2019
#58893 nodejs12 @12.9.1: error: use of undeclared identifier 'strnlen' ports defect Aug 27, 2019
#59219 fossil fails to build from source if ccache port installed ports defect Oct 9, 2019
#59220 git @ 2.23.0_1 +credential_osxkeychain "unexpected token: !tapi-tbd-v3" - build failure ports defect Oct 9, 2019
#59262 nodejs10 @ 10.16.3_0.darwin_19.x86_64: Failed to Build Error ports defect Oct 11, 2019
#59324 erlang: beam_emu_pg.gcda: No such file or directory ports defect Oct 14, 2019
#59382 nodejs10 @10.18.1: build fails on Catalina with error related to assembler ports defect Oct 18, 2019
#59417 git @2.23.0_1 build failure ports defect Oct 21, 2019
#59419 nodejs12 @ 12.12.0_1: gyp: No Xcode or CLT version detected! ports defect Oct 22, 2019
#59531 nodejuice, npm3, npm4: depend on nodejs6 which is replaced by another port ports defect Oct 31, 2019
#59974 nodejs10 @10.18.1: gyp: No Xcode or CLT version detected! ports defect Jan 16, 2020
#60221 go @1.14.1: Undefined symbols _fdopendir$INODE64 ports defect Mar 21, 2020
#60361 nodejs14: uv/errno.h file missing ports defect Apr 16, 2020
#60611 go: Undefined symbols _macports_legacy_sysconf ports defect Jun 7, 2020
#54384 Erlang+wxwidgets doesn't need libGLU ports enhancement Jun 26, 2017
#54688 nodejs fails to build with libressl ports enhancement Aug 29, 2017
#56664 enable diff-highlight in git, with variant ports enhancement Jun 14, 2018
#58862 git @2.23.0: make Python optional ports enhancement Aug 22, 2019
#56912 factor: update to 0.98 ports update Aug 4, 2018
#58374 erlang @21.1: update to 21.3 ports update Apr 23, 2019

cjones051073 (8 matches)

Ticket Summary Component Milestone Type Created
#56892 root6 @6.14.02 fails to build with +veccore variant ports defect Jul 31, 2018
#57096 root6 6.14.02 installed with python36 variant when python34 variant is specified ports defect Sep 4, 2018
#57157 root6 with +veccore variant has include path problems ports defect Sep 25, 2018
#57538 Change macports-legacy-support license to BSD ports defect Nov 7, 2018
#57601 ROOT6 headers broken ports defect Nov 14, 2018
#58874 bazel: +bash variant doesn't build ports defect Aug 23, 2019
#60474 py-spaCy @2.2.4: the `allow-hosts` option is not supported when using pip to install requirements ports defect May 12, 2020
#60780 py38-mkl @2019.0: changing install names or rpaths can't be redone ... because larger updated load commands do not fit ports defect Jul 4, 2020

conradwt (1 match)

Ticket Summary Component Milestone Type Created
#59549 amber: Error: unexpected token: = ports defect Oct 31, 2019

count0 (4 matches)

Ticket Summary Component Milestone Type Created
#57767 py36-graph-tool uses incorrect python version 2.7 ports defect Dec 12, 2018
#57786 py37-graph-tool graph_draw throws segmentation fault without XQuartz running ports defect Dec 17, 2018
#58581 py27-graph-tool @2.2.26: We could not detect the boost libraries ports defect Jun 10, 2019
#59890 py-graph-tool has wrong condition for deciding when to use sparsehash ports defect Dec 26, 2019

ctreleaven (6 matches)

Ticket Summary Component Milestone Type Created
#53247 lirc @0.9.4c: curl_poll.h contains erroneous #include "config.h" ports defect Jan 8, 2017
#56503 mythtv.27, mythtv-pkg.27, mythtv-pkg.28: Unsuitable version numbers ports defect May 16, 2018
#58005 mythtv-core.28 @ 0.28.2-Fixes-20180201_5: Build failure on OSX 10.11 because of qt5 is replaced by qt511 ports defect Feb 2, 2019
#58576 mythtv-core.27 building internal ffmpeg ports defect Jun 9, 2019
#58722 mythtv-core @0.28: Build error on Mojave ports defect Jul 14, 2019
#60668 mythtv-core.27: error: use of undeclared identifier 'x264_bit_depth' ports defect Jun 17, 2020

danchr (2 matches)

Ticket Summary Component Milestone Type Created
#59925 pypy @7.3.0: reinplace /MACOSX_DEPLOYMENT_TARGET/s/10\.\([0-9]*\)/10.7/ didn't change anything ports defect Jan 7, 2020
#60435 geckodriver @0.21.0: error[E0713]: borrow may still be in use when destructor runs ports defect May 4, 2020

danieljprice (2 matches)

Ticket Summary Component Milestone Type Created
#53225 splash @2.5.1_2 (no variants): Reading module 'giza' at line 1144 column 61: Unexpected EOF ports defect Jan 6, 2017
#57103 giza @1.0.0: Installs file /opt/local/lib/opt/local/bin/gfortran-mp-7/modules/giza.mod ports defect Sep 6, 2018

danielluke (4 matches)

Ticket Summary Component Milestone Type Created
#41378 Installing subversion-javahlbindings (1.8.4) fails on OS X 10.9 ports defect Nov 15, 2013
#42351 subversion-javahlbindings @1.8.5_0+no_bdb: build failure ports defect Feb 2, 2014
#48935 subversion-javahlbindings does not build, looks for /bin/javac ports defect Sep 20, 2015
#39435 clamav ports enhancement Jun 14, 2013

Dave-Allured (1 match)

Ticket Summary Component Milestone Type Created
#47182 netcdf-fortran 4.4.2: Seg fault in nf90_get_att ports defect Mar 17, 2015

davidnich (2 matches)

Ticket Summary Component Milestone Type Created
#56213 qore ports need updates ports defect Apr 2, 2018
#60015 qore-freetds-module fails to fetch ports defect Jan 26, 2020

dbevans (2 matches)

Ticket Summary Component Milestone Type Created
#19438 gimp2 2.6.6_0: Crash - Uncaught exception NSInvalidArgumentException was raised ports defect Apr 26, 2009
#24460 gimp +quartz crashes - gtk errors ports defect Apr 12, 2010
1 2 3 4 5 6 7 8 9 10 11
Note: See TracReports for help on using and creating reports.