New Ticket     Tickets     Wiki     Browse Source     Timeline     Roadmap     Ticket Reports     Search

{8} Active Tickets, Mine first (3811 matches)

  • List all active tickets by priority.
  • Show all tickets owned by the logged in user in a group first.

Results (601 - 700 of 3811)

1 2 3 4 5 6 7 8 9 10 11 12 13 14 15 16 17

Active Tickets (100 matches)

Ticket Summary Component Version Milestone Type Owner Status Created
#34183 gst-plugins-ugly @0.10.19_2 missing headers ports 2.0.4 defect macports-tickets@… new 04/23/12
#34186 evince @2.30.3 configure failure: "PDF support is disabled since poppler-glib library version 0.12.0 or newer not found" ports 2.0.4 defect devans@… new 04/23/12
#34212 liblrdf compilation problems ports 2.0.4 defect pixilla@… new 04/25/12
#34215 gst-plugins-base @0.10.36_1 +universal destroot failure ports 2.0.4 defect macports-tickets@… new 04/25/12
#34224 n2n: subversion check out failed, certificate issued for a different hostname ports 2.0.4 defect msmk@… new 04/25/12
#34228 php5: fsockopen don't work since php 5.3.10, with openssl 1.0.1b_0 ports 2.0.4 defect ryandesign@… new 04/26/12
#34231 ImageMagick: should not depend on pango + fix openMP ports 2.0.4 defect ryandesign@… new 04/27/12
#34256 tex-whizzytex @1.3.1 Configure failure: "Cannot run initex with any of the formats: latex latex" ports 2.0.4 defect macports-tickets@… new 04/29/12
#34264 digikam: Undefined symbols for architecture x86_64 ports 2.0.4 defect jan@… new 04/30/12
#34271 python27 2.7.3_0 py27-gtk 2.22.0_1 etc -- pkg-config files not installed correctly for python 2.6 and 2.7 versions of pygtk and pygobject ports 2.0.4 defect macports-tickets@… new 04/30/12
#34305 VTK: error: ‘FSSpec’ has no member named ‘name’ ports 2.0.4 defect css@… new 05/02/12
#34308 pkgconfig: Undefined symbols ports 2.0.4 defect ryandesign@… new 05/02/12
#34339 gdal +framework variant fails to install ports 2.0.4 defect macports-tickets@… new 05/04/12
#34383 curl @7.25.0 SFTP fails with "Failure establishing ssh session" (2) ports 2.0.4 defect ryandesign@… new 05/09/12
#34389 strategoxt fails to install ports 2.0.4 defect macports-tickets@… new 05/09/12
#34403 rpm activation fails on buildbot: __init__.py already exists ports 2.0.4 defect afb@… reopened 05/10/12
#34407 glw: libtool: link: require no space between `-L' and `-lXft' ports 2.0.4 defect css@… new 05/10/12
#34412 apt will not compile at the end ports 2.0.4 defect landonf@… new 05/11/12
#34415 dbus-devel: build fails ports 2.0.4 defect pixilla@… new 05/11/12
#34417 nu2: fatal error: 'Foundation/Foundation.h' file not found ports 2.0.4 defect macports-tickets@… new 05/11/12
#34427 playerstage-player: build uses /Library/Frameworks/Python.framework, fails ports 2.0.4 defect vincent@… new 05/12/12
#34447 freeciv 2.3.2 not compiling with global variants set to -x11 +no_x11 ports 2.0.4 defect macports-tickets@… new 05/14/12
#34448 webkit-gtk +quartz missing symbol: Webcore::PluginView::invalidateRect ports 2.0.4 defect devans@… new 05/14/12
#34470 xgraph segmentation fault ports 2.1.0 defect ryandesign@… assigned 05/16/12
#34502 ogre@1.7.3 - pbxcp command execution failed, build failed. ports 2.1.0 defect marin@… assigned 05/18/12
#34538 Soprano 2.7.4 fails to build with wrong-arch iodbc.framework in /Library/Frameworks ports 2.1.1 defect pixilla@… new 05/20/12
#34539 ophcrack: add fast and small variants ports 2.1.1 defect macports-tickets@… new 05/20/12
#34547 python27: Failed to locate 'xz' in path ports 2.1.1 defect jwa@… new 05/20/12
#34548 dansguardian doesn't start anymore since upgrade to macports 2.1.0 ports 2.1.1 defect macports-tickets@… new 05/20/12
#34565 TeXmacs: error: variable length array of non-POD element type 'string' ports 2.1.1 defect macports-tickets@… new 05/21/12
#34566 unison: uigtk2.cmx and /opt/local/lib/ocaml/lablgtk2/lablgtk.cmxa make inconsistent assumptions over implementation GtkSignal ports 2.1.1 defect macports-tickets@… new 05/21/12
#34572 samba3 @3.6.5 fails to initialize on startup ports 2.1.1 defect macports-tickets@… new 05/21/12
#34592 ImageMagick: do not link with linkclparser.dylib on Snow Leopard ports 2.1.1 defect ryandesign@… new 05/23/12
#34639 gdc @0.24 Build failure due to redefinition of functions ports 2.1.1 defect mww@… new 05/27/12
#34660 Freecell @2.1 installation failure at staging Freecell into destroot ports 2.1.1 defect macports-tickets@… new 05/28/12
#34675 gdk-pixbuf fails to compile on x86_64 (Lion) ports 2.1.1 defect macports-tickets@… new 05/30/12
#34702 nagios-plugins +universal fails: -E, -S, -save-temps and -M options are not allowed with multiple -arch flags ports 2.1.1 defect macports-tickets@… new 05/31/12
#34714 mozart 1.4.0_1 build failure ports 2.1.1 defect bfulgham@… new 06/01/12
#34750 py32-numpy fails to build on snow leopard/XCode4.2 ports 2.1.1 defect macports-tickets@… new 06/04/12
#34758 ImageMagick +rsvg needs xorg-xcb ports 2.1.1 defect ryandesign@… new 06/04/12
#34806 mkvtoolnix needs boost and icu built with same compiler ports defect macports-tickets@… reopened 06/08/12
#34823 cdrtools: missing isoinfo, mkhybrid, and mkisofs ports 2.1.1 defect macports-tickets@… new 06/10/12
#34832 PORT/work/.home/.subversion and proxy access base 2.1.1 defect macports-tickets@… new 06/11/12
#34837 libwpd @0.8.14_0 +universal Build failure ports 2.1.1 defect devans@… new 06/11/12
#34852 powerpc-rtems-gcc @4.2.3 doesn't compile with its default compiler ports 2.1.1 defect macports-tickets@… new 06/13/12
#34863 peekabot-server: ‘class boost::asio::basic_stream_socket<boost::asio::ip::tcp, boost::asio::stream_socket_service<boost::asio::ip::tcp> >’ has no member named ‘io_service’ ports 2.1.1 defect staffan@… new 06/14/12
#34876 dircproxy 1.0.5 does not compile with clang/llvm 3.0 on OS X Lion ports 2.1.1 defect darwin@… new 06/15/12
#34877 avahi: opportunistic linking? ports 2.1.99 defect macports-tickets@… new 06/15/12
#34885 nagios-plugins does not list library dependencies ports 2.1.1 defect macports-tickets@… new 06/16/12
#34887 ehcache 1.1.0 CVS login failed ports 2.1.1 defect macports-tickets@… new 06/16/12
#34891 swig: subports do not respect build_arch ports 2.1.1 defect michaelld@… new 06/16/12
#34895 reduce-algebra installs but does not run ports 2.1.1 defect mark.brethen@… new 06/17/12
#34906 installing kerberos5 breaks OS X' ssh ports 2.1.1 defect macports-tickets@… new 06/18/12
#34930 Precompiled binary packages incompatible with installed dependencies ports 2.1.1 defect mcalhoun@… new 06/19/12
#34935 Moving a port from /users to /trunk/dports or changing a file in portdir/files doesn't trigger buildbot rebuild server/hosting 2.1.1 defect wsiegrist@… new 06/19/12
#34945 liblrdf: ../libtool: command not found ports 2.1.1 defect pixilla@… new 06/20/12
#34954 user macports needs write access on Preferences directory base 2.1.1 defect macports-tickets@… new 06/22/12
#34962 ghostscript cannot be built for archs that cannot be run ports 2.1.1 defect takanori@… new 06/24/12
#34975 expat: Failed to verify signature for archive! ports 2.1.1 defect ryandesign@… new 06/26/12
#34990 shogun: Undefined symbols: _drot_ _dswap_ __gfortran_concat_string _dgemm_ etc. ports 2.1.1 defect macports-tickets@… new 06/27/12
#34995 Segfault building libgweather @ 2.30.3 ports 2.1.1 defect devans@… new 06/27/12
#35022 glob2: error: reference to 'Collection' is ambiguous ports 2.1.1 defect macports-tickets@… new 06/29/12
#35033 python26, python27: Build Applet looking for /Volumes/work/macports/Library/Frameworks/Python.framework/Versions/2.X/Resour ports 2.1.1 defect jwa@… new 06/30/12
#35036 kde4 baseapps crash (compiled from source for different root tree) ports 2.1.1 defect nicos@… new 06/30/12
#35066 grace @5.1.22_6 - Grace crash on Print ports 2.1.1 defect macports-tickets@… new 07/03/12
#35070 gcc47: _GLIBCXX_DEBUG and empty ostringstream ports 2.1.1 defect mww@… new 07/03/12
#35088 OpenCV 2.4.1 has a bug on the pkg-config files ports 2.1.1 defect stromnov@… new 07/05/12
#35089 ImageMagick 6.7.8 ImageMagick++ is broken ports 2.1.1 defect ryandesign@… new 07/05/12
#35093 mpkg / mdmg requires cleaning and reinstalling every time base 2.1.1 defect macports-tickets@… reopened 07/05/12
#35112 arm-none-linux-gnueabi-gcc: error: duplicate case value '0' ports 2.1.1 defect stuartwesterman@… new 07/07/12
#35136 despotify: no sound ports 2.1.1 defect mail@… new 07/09/12
#35149 arm-aout-gcc: cc1: internal compiler error: Segmentation fault: 11 ports 2.1.1 defect macports-tickets@… new 07/10/12
#35155 ImageMagick @6.7.8-0 install can't read "portvariants": no such variable ports 2.1.1 defect ryandesign@… new 07/11/12
#35167 Hydrogen fails to build ports 2.1.1 defect xenith@… new 07/11/12
#35222 php-imap causes cli to take 35 seconds to initialize ports 2.1.1 defect ryandesign@… new 07/16/12
#35228 pear-PHPUnit 3.6.11 wil not build ports 2.1.1 defect macports-tickets@… new 07/17/12
#35230 p5.12-mail-spamassassin @3.2.5, Revision 6, runtime warnings, uses deprecated perl constucts ports 2.1.1 defect macports-tickets@… new 07/17/12
#35236 qmail-spamcontrol: nameser8_compat.h: No such file or directory ports 2.1.1 defect compconsultant@… new 07/17/12
#35267 php-gearman error for object pointer being freed was not allocated ports 2.1.1 defect rodney.rehm@… new 07/20/12
#35297 emacs-w3m @1.4.4 build failure -package depends on old emacs23 ports 2.1.1 defect easieste@… new 07/23/12
#35307 opencv @2.4.2 +universal configure failure: command execution failed ports 2.1.1 defect stromnov@… new 07/24/12
#35323 py26-mapnik: undefined symbols boost::system::generic_category boost::system::system_category ports 2.1.1 defect dbsgeo@… new 07/26/12
#35328 w3m @0.5.3 build failure: func.c:200:24: error: use of undeclared identifier 'functable' ports 2.1.2 defect macports-tickets@… new 07/26/12
#35341 Xcode not found when user directory is not on main drive base 2.1.2 defect macports-tickets@… new 07/26/12
#35368 unable to build opencv with llvm-gcc-4.2 ports 2.1.2 defect stromnov@… new 07/27/12
#35370 hamcrest-core fails to build on Mountain Lion ports 2.1.2 defect macports-tickets@… new 07/27/12
#35374 smake is not UsingTheRightCompiler ports 2.1.2 defect mww@… new 07/27/12
#35419 gcc48 fails to build on Mountain Lion ports 2.1.2 defect mww@… new 07/29/12
#35468 nmh does not build with clang ports 2.1.2 defect kenh@… new 08/01/12
#35471 Gconf-sanity-check-2 fails ports 2.1.2 defect macports-tickets@… new 08/01/12
#35491 bzrtools: 2.5.0 rspush generates exception ports 2.1.2 defect raimue@… new 08/01/12
#35538 opendx is not UsingTheRightCompiler ports 2.1.2 defect macports-tickets@… new 08/05/12
#35543 SuiteSparse fails to build on Tiger, G3 ports 2.1.2 defect macports-tickets@… new 08/05/12
#35554 Port gimp fails starting ports 2.1.2 defect devans@… new 08/06/12
#35575 unable to install xfree86 ports 2.1.2 defect macports-tickets@… new 08/07/12
#35583 openssl @1.0.1c openssl configure fails on Mountain Lion ports 2.1.99 defect larryv@… new 08/07/12
#35593 gcc47 @4.7.1, Revision 2 -- Undefined symbols from standard library ports 2.1.2 defect mww@… new 08/08/12
#35635 MacVim: Bad font rendering ports 2.1.2 defect raimue@… assigned 08/12/12
#35653 gconf 2.28.1_3 +quartz connections from client to gconfd fail ports 2.1.2 defect macports-tickets@… new 08/13/12
#35659 jikesrvm: /usr/bin/jikes: Command not found ports 2.1.2 defect macports-tickets@… new 08/13/12
1 2 3 4 5 6 7 8 9 10 11 12 13 14 15 16 17
Note: See TracReports for help on using and creating reports.