New Ticket     Tickets     Wiki     Browse Source     Timeline     Roadmap     Ticket Reports     Search

{8} Active Tickets, Mine first (3725 matches)

  • List all active tickets by priority.
  • Show all tickets owned by the logged in user in a group first.

Results (601 - 700 of 3725)

1 2 3 4 5 6 7 8 9 10 11 12 13 14 15 16 17

Active Tickets (100 matches)

Ticket Summary Component Version Milestone Type Owner Status Created
#32141 munin node fail to update with "Plugin XYZ Can't drop privileges: setrgid()" ports 2.0.3 defect alpha@… new 11/19/11
#32151 org-mode-devel must support an emacs_app variant ports 2.0.3 defect phw@… new 11/19/11
#32157 Maude v2.6 build failure: error: '_Data_allocate' is not a member of 'std::allocator<char>' ports 2.0.3 defect dcolish@… new 11/20/11
#32159 iTerm: CGSConnection.h:33: error: parse error before ‘AVAILABLE_MAC_OS_X_VERSION_10_5_AND_LATER’ ports 2.0.3 defect macports-tickets@… new 11/20/11
#32182 ksh93: compiler, arch flags ports 2.0.3 defect macports-tickets@… new 11/22/11
#32216 elinks: lib.o non-external symbol 757 (___i686.get_pc_thunk.bx) can't be a weak definition ports 2.0.3 defect macports-tickets@… new 11/23/11
#32220 TrailBlazer: fetch time out ports 2.0.3 defect papabean@… new 11/23/11
#32221 uzbl: gdk/gdkx.h: No such file or directory ports 2.0.3 defect ryandesign@… new 11/23/11
#32245 openal: error: redefinition of parameter 'inBuffer' ports 2.0.3 defect macports-tickets@… new 11/24/11
#32281 gstreamer @0.10.35 error on i386 ports 2.0.3 defect rmstonecipher@… new 11/26/11
#32287 curl: curl-config differs and cannot be merged ports 2.0.3 defect ryandesign@… new 11/27/11
#32305 catdoc doesn't depend on tk ports 2.0.3 defect julian@… new 11/28/11
#32318 pythia @8.135_0 conflicts with libevent on Event.h ports 2.0.3 defect mattiafrancescomoro@… new 11/29/11
#32326 tigervnc: Missing /opt/local/bin/Xvnc ports 2.0.3 defect macports-tickets@… new 11/29/11
#32338 contacts: no utf8 support ports 2.0.3 defect macports-tickets@… new 11/30/11
#32340 xmms2 clang conf error with clang ports 2.0.3 defect ryandesign@… assigned 11/30/11
#32345 mdk: MMIX mixvm causes seg fault on Mac OS X 10.6 ports 2.0.3 defect aconchillo@… new 11/30/11
#32356 wireshark: segmentation fault when cairo and pango use +quartz ports 2.0.3 defect opendarwin.org@… new 12/01/11
#32359 javascript-lint: Darwin_DBG.OBJ/libjs.a(jsmath.o) non-external symbol 962 (___i686.get_pc_thunk.bx) can't be a weak definition ports 2.0.3 defect rwilcox@… new 12/01/11
#32410 pango: segmentation fault while running pango-querymodules in post-destroot ports 2.0.3 defect ryandesign@… new 12/05/11
#32414 Can't install qemu-usermode ports 2.0.3 defect mww@… new 12/05/11
#32420 cssed crashes at launch when built against gtk2 +quartz ports 2.0.3 defect macports-tickets@… new 12/05/11
#32455 glade3 +quartz variant doesn't build ports 2.0.3 defect devans@… new 12/07/11
#32479 TOra: toconfiguration.cpp:763: internal compiler error: in lower_stmt, at gimple-low.c:209 ports 2.0.3 defect pvanek@… new 12/09/11
#32480 gcc47: Segmentation fault in build/genattrtab ports 2.0.3 defect mww@… new 12/09/11
#32525 root: building with +opengl variant results in undefined FTGL symbols ports 2.0.3 defect jonesc@… new 12/13/11
#32526 ffmpeg fails to build on Mac OS 10.4.11 PPC ports 2.0.3 defect devans@… new 12/13/11
#32554 perl5.12: pp.c:(.text+0x2f3a): undefined reference to `pow' ports 2.0.3 defect macports-tickets@… new 12/15/11
#32565 duplicity 0.6.17: UnicodeDecodeError with WebDAVs backend ports 2.0.3 defect macports-tickets@… new 12/16/11
#32567 xmms2 ao crashes on osx ports 2.0.3 defect macports-tickets@… new 12/16/11
#32575 llvm-3.{1,2}: fail to build with python3 selected ports 2.0.3 defect jeremyhu@… assigned 12/17/11
#32581 reduce-algebra: don't break when runtime OS version != build-time OS version ports 2.0.3 defect mark.brethen@… new 12/18/11
#32583 reduce-algebra: install docs in standard location ports 2.0.3 defect mark.brethen@… new 12/18/11
#32595 reduce-algebra @3.8.0-r1530 - build error ports 2.0.3 defect mark.brethen@… new 12/19/11
#32596 xfce4-panel: expected ‘=’, ‘,’, ‘;’, ‘asm’ or ‘__attribute__’ before ‘gchar’ ports 2.0.3 defect afb@… new 12/19/11
#32601 Can't open any windows from the color menu of gimp ports 2.0.3 defect devans@… new 12/19/11
#32627 nusmv: universal variant fails ports 2.0.3 defect mww@… new 12/22/11
#32642 ImageMagick's PC files contain -fopenmp which makes GCC 4.0 fail ports 2.0.3 defect ryandesign@… new 12/23/11
#32646 qtiplot 0.9.8.9 crashes on launch ports 2.0.3 defect nicos@… new 12/23/11
#32651 xfce4-panel @4.6.4: unknown type name 'G_CONST_RETURN' ports 2.0.3 defect afb@… new 12/24/11
#32652 gvfs cannot open remote urls ports 2.0.3 defect macports-tickets@… new 12/24/11
#32664 php5-unit @3.5.15: Failed opening required 'PHP/CodeCoverage/Filter.php' ports 2.0.3 defect macports-tickets@… new 12/26/11
#32680 gdk-pixbuf2 configure error: Checks for TIFF loader failed ports 2.0.3 defect devans@… new 12/27/11
#32700 port upgrade -u py25-wxpython fails to deactivate old version base 2.0.3 defect macports-tickets@… new 12/29/11
#32706 py-pyodbc: can't find MacPorts ODBC drivers ports 2.0.3 defect macports-tickets@… new 12/30/11
#32719 mpd crash on Lion when playing m4a files ports 2.0.3 defect rmstonecipher@… new 01/01/12
#32753 git-svn assertion failed (svn_uri_is_canonical(repos_URL, pool)) ports 2.0.3 defect ciserlohn@… new 01/03/12
#32757 error: port install gst +nox-gtk-tcltk ports 2.0.3 defect saispo@… new 01/04/12
#32797 grass does not ensure it's UsingTheRightCompiler ports 2.0.3 defect macports-tickets@… new 01/06/12
#32817 postgresql91-server @9.1.2_0 initialization fails ports 2.0.3 defect macports-tickets@… new 01/09/12
#32827 xsane not working with Canon Lide Scanner ports 2.0.3 defect michael.klein@… new 01/09/12
#32836 erlang: build error when /opt/local/bin/gcc exists ports 2.0.3 defect ciserlohn@… new 01/10/12
#32842 swig-python build fails for non-default build_arch ports 2.0.3 defect kevin@… new 01/10/12
#32844 gimp segfaults when browsing an image folder ports 2.0.3 defect devans@… new 01/10/12
#32868 Can't start kde 3 ports 2.0.3 defect macports-tickets@… new 01/12/12
#32911 growl could not be installed on Mac OSX 10.7.3 ports 2.0.3 defect macports-tickets@… new 01/17/12
#32916 rabbitmq-server: launchctl script does not match created node ports 2.0.3 defect meyer@… new 01/17/12
#32919 arq_restore installs binaries into applications_dir ports 2.0.3 defect singingwolfboy@… new 01/18/12
#32945 dbus needs unloading and reloading the .plist items in order for applications to connect to it ports 2.0.3 defect mcalhoun@… new 01/19/12
#32957 ocamlsdl does not apply a needed patch ports 2.0.3 defect mww@… new 01/20/12
#32967 cvsps needs to be UsingTheRightCompiler ports defect erickt@… new 01/21/12
#32994 build of valgrind 3.7.0 on Leopard fails; gcc version not detected properly ports 2.0.3 defect raimue@… assigned 01/23/12
#33008 gmic: update to 1.5.0.9 ports 2.0.3 defect assemlal@… new 01/24/12
#33045 cadabra: build fails with clang ports 2.0.3 defect gwright@… new 01/28/12
#33065 sbcl @1.0.55 will not build on PPC under leopard 10.5.8 ports 2.0.3 defect easieste@… new 01/30/12
#33072 p5.14-data-ical configure failure ports 2.0.3 defect macports-tickets@… new 01/30/12
#33078 p5.14-io-kqueue build failure ports 2.0.3 defect pmq@… new 01/30/12
#33083 p5.14-convert-binary-c does not build ports 2.0.3 defect jason@… new 01/30/12
#33088 xemacs 21.4.22_4 crash when entering font-lock-mode ports 2.0.3 defect macports-tickets@… new 01/31/12
#33099 amarok: dyld: Symbol not found: __ZN6Amarok20qt_mac_set_dock_menuEP5QMenu ports 2.0.3 defect macports-tickets@… new 02/01/12
#33156 x264 @20111023 +universal Build failure - MMX error on i386 ports 2.0.3 defect devans@… new 02/06/12
#33166 fortune: limerick data file contains offensive fortunes ports 2.0.3 defect macports-tickets@… new 02/06/12
#33179 xymon and xymon-server disagree about whether clientlaunch.cfg should be registered to the port or not ports 2.0.3 defect fclaire@… new 02/07/12
#33187 kdeinit4 doesn't start: complains about dbus not running ports 2.0.3 defect macports-tickets@… new 02/07/12
#33191 digikam does not show pictures after upgrade ports 2.0.3 defect jan@… new 02/08/12
#33193 mysql5-server: sudo port load: child killed: trace trap ports 2.0.3 defect ryandesign@… new 02/08/12
#33203 tclx - Remove dependency from Tcl 8.4 and locally copied private header files ports 2.0.3 defect markd@… new 02/09/12
#33225 gmake: info documentation not installed ports 2.0.3 defect macports-tickets@… new 02/11/12
#33231 ccaudio @1.1.1 build failure ports 2.0.3 defect macports-tickets@… new 02/12/12
#33262 GTK2 build fails in 10.4.11 because system CUPS is too old ports 2.0.3 defect macports-tickets@… reopened 02/15/12
#33270 php5 build failure with distcc? ports 2.0.3 defect ryandesign@… new 02/16/12
#33292 Amarok @2.4.3 will not build! ports 2.0.3 defect macports-tickets@… new 02/18/12
#33299 --with-macports-user also sets the group base 2.0.3 defect macports-tickets@… new 02/19/12
#33316 pgplot: build fails ports 2.0.3 defect mcalhoun@… new 02/20/12
#33326 cyrus-sasl2 @2.1.23 +universal +kerberos: libsasl2.la differs and cannot be merged ports 2.0.3 defect macports-tickets@… new 02/22/12
#33335 Pallet doesn't work (nothing happens); no documentation ports 2.0.3 defect macports-tickets@… new 02/23/12
#33341 android @16 Problem with permissions folder ports 2.0.3 defect krischik@… new 02/23/12
#33343 encoding x264 with ffmpeg does not use CPU capabilities on 64bit 10.7.3 ports 2.0.3 defect devans@… new 02/23/12
#33370 wget should use curl-ca-bundle by default ports 2.0.3 defect ryandesign@… new 02/27/12
#33382 gdbm @1.10 build failure ports 2.0.3 defect macports-tickets@… new 02/27/12
#33387 kbuildsycoca4 error 88500 after installing kdewebdev ports 2.0.3 defect nicos@… new 02/27/12
#33414 images_to_archives failed during selfupdate base 2.0.4 defect macports-tickets@… new 02/29/12
#33428 gcc44 @4.4.6: malloc.h: No such file or directory ports 2.0.4 defect mww@… new 02/29/12
#33448 libvpx: universal build fails ports 2.0.4 defect macports-tickets@… new 03/02/12
#33463 bitdht does not build for the right archs ports 2.0.4 defect snc@… new 03/03/12
#33474 AbiWord: ssize_t not defined? ports 2.0.4 defect macports-tickets@… new 03/04/12
#33475 gcc46 4.6.3 internal compiler error: in objc_eh_runtime_type ports 2.0.4 defect mww@… new 03/04/12
#33477 selfupdate failed from 2.0.3 to 2.0.4 @ 10.6.8, xcode 3.2 base 2.0.3 defect macports-tickets@… new 03/05/12
#33479 p5.12-cgi-speedycgi fails to build with clang ports 2.0.4 defect markd@… new 03/05/12
#33486 mysql5 doesn't start ports 2.0.4 defect ryandesign@… new 03/05/12
1 2 3 4 5 6 7 8 9 10 11 12 13 14 15 16 17
Note: See TracReports for help on using and creating reports.