Opened 13 years ago

Closed 13 years ago

Last modified 12 years ago

#13460 closed defect (duplicate)

gnome-keyring: parse error before "size_t"

Reported by: karasisi@… Owned by: macports-tickets@…
Priority: Normal Milestone:
Component: ports Version: 1.5.2
Keywords: Cc:
Port:

Description (last modified by jmpp@…)

---> Building gnome-keyring with target all
Error: Target org.macports.build returned: shell command " cd "/opt/local/var/macports/build/_opt_local_var_macports_sources_rsync.macports.org_release_ports_gnome_gnome-keyring/work/gnome-keyring-2.20.1" && make all " returned error 2
Command output: make all-recursive
Making all in .
make[2]: Nothing to be done for `all-am'.
Making all in common
/bin/sh ../libtool --tag=CC --mode=compile gcc -DHAVE_CONFIG_H -I. -I.. -I.. -I/opt/local/include -L/opt/local/lib -DPREFIX=\""/opt/local"\" -DBINDIR=\""/opt/local/bin"\" -DLIBEXECDIR=\""/opt/local/libexec"\" -DGNOMELOCALEDIR=\""/opt/local/share/locale"\" -I/opt/local/include -I/opt/local/include -DXTHREADS -I/opt/local/include/gtk-2.0 -I/opt/local/lib/gtk-2.0/include -I/opt/local/include/atk-1.0 -I/opt/local/include/cairo -I/opt/local/include/pango-1.0 -I/opt/local/include/glib-2.0 -I/opt/local/lib/glib-2.0/include -I/opt/local/include -I/opt/local/include/freetype2 -I/opt/local/include/libpng12 -I/usr/X11R6/include -I/opt/local/include/glib-2.0 -I/opt/local/lib/glib-2.0/include -I/opt/local/include -O2 -MT libgkr_daemon_common_la-gkr-secure-memory.lo -MD -MP -MF .deps/libgkr_daemon_common_la-gkr-secure-memory.Tpo -c -o libgkr_daemon_common_la-gkr-secure-memory.lo `test -f 'gkr-secure-memory.c' || echo './'`gkr-secure-memory.c
gcc -DHAVE_CONFIG_H -I. -I.. -I.. -I/opt/local/include -L/opt/local/lib -DPREFIX=\"/opt/local\" -DBINDIR=\"/opt/local/bin\" -DLIBEXECDIR=\"/opt/local/libexec\" -DGNOMELOCALEDIR=\"/opt/local/share/locale\" -I/opt/local/include -I/opt/local/include -DXTHREADS -I/opt/local/include/gtk-2.0 -I/opt/local/lib/gtk-2.0/include -I/opt/local/include/atk-1.0 -I/opt/local/include/cairo -I/opt/local/include/pango-1.0 -I/opt/local/include/glib-2.0 -I/opt/local/lib/glib-2.0/include -I/opt/local/include -I/opt/local/include/freetype2 -I/opt/local/include/libpng12 -I/usr/X11R6/include -I/opt/local/include/glib-2.0 -I/opt/local/lib/glib-2.0/include -I/opt/local/include -O2 -MT libgkr_daemon_common_la-gkr-secure-memory.lo -MD -MP -MF .deps/libgkr_daemon_common_la-gkr-secure-memory.Tpo -c gkr-secure-memory.c -fno-common -DPIC -o .libs/libgkr_daemon_common_la-gkr-secure-memory.o
In file included from gkr-secure-memory.c:34:
/usr/include/sys/mman.h:155: error: parse error before "size_t"
/usr/include/sys/mman.h:158: error: parse error before "size_t"
/usr/include/sys/mman.h:160: error: parse error before "size_t"
/usr/include/sys/mman.h:161: error: parse error before "size_t"
/usr/include/sys/mman.h:162: error: parse error before "size_t"
/usr/include/sys/mman.h:163: error: parse error before "size_t"
/usr/include/sys/mman.h:166: error: parse error before "size_t"
/usr/include/sys/mman.h:170: error: parse error before "caddr_t"
/usr/include/sys/mman.h:171: error: parse error before '*' token
/usr/include/sys/mman.h:174: error: parse error before "size_t"
/usr/include/sys/mman.h:175: error: parse error before "size_t"
/usr/include/sys/mman.h:176: error: parse error before "size_t"
make[2]: *** [libgkr_daemon_common_la-gkr-secure-memory.lo] Error 1
make[1]: *** [all-recursive] Error 1
make: *** [all] Error 2

Error: The following dependencies failed to build: gimp2 libgnomeui gnome-keyring libbonoboui dbus docbook-xml-4.1.2 xmlcatmgr libxml2 xmlto docbook-xml-4.2 docbook-xsl getopt libxslt dbus-glib gconf intltool orbit2 libidl gnome-vfs gnome-mime-data howl neon openssl libbonobo popt autoconf help2man p5-locale-gettext libtool m4 libglade2 libgnome esound audiofile libgnomecanvas gail libgtkhtml libmng automake lcms librsvg libcroco libgsf libwmf poppler poppler-data py25-gtk py25-cairo py25-numeric python25 py25-gobject
Error: Status 1 encountered during processing.
emac5s-Computer:~ emac5$

Change History (5)

comment:1 Changed 13 years ago by jmpp@…

Description: modified (diff)
Milestone: Port Bugs

comment:2 Changed 13 years ago by ryandesign (Ryan Schmidt)

Summary: sudo port install gimpgnome-keyring: parse error before "size_t"

comment:3 Changed 13 years ago by william.allen.simpson@…

duplicate #12959

comment:4 Changed 13 years ago by jmroot (Joshua Root)

Resolution: duplicate
Status: newclosed

comment:5 Changed 12 years ago by (none)

Milestone: Port Bugs

Milestone Port Bugs deleted

Note: See TracTickets for help on using tickets.