Opened 12 years ago

Closed 12 years ago

Last modified 11 years ago

#13488 closed defect (fixed)

wine 0.9.50_0 won't build on Mac OS X 10.5 Leopard

Reported by: ryandesign (Ryan Schmidt) Owned by: ryandesign (Ryan Schmidt)
Priority: Normal Milestone:
Component: ports Version: 1.5.2
Keywords: Cc: sven.wolf@…
Port:

Description

It was reported on the mailing list that wine 0.9.50_0 fails to build on Leopard in new and exciting ways, different from the ways in which wine 0.9.49_0 and earlier fail to build on Leopard (which are handled in ticket #13000). The new failures with 0.9.50_0 are:

./ntoskrnl.exe.spec:606: external symbol 'KeServiceDescriptorTable' is
not a function
./ntoskrnl.exe.spec:625: external symbol 'KeTickCount' is not a function
winegcc: ../../tools/winebuild/winebuild failed
make[2]: *** [ntoskrnl.exe.so] Error 2
make[1]: *** [ntoskrnl.exe] Error 2
make: *** [dlls] Error 2

Change History (3)

comment:1 Changed 12 years ago by tannhaus@…

As of today, 12/19/07, I can verify that wine 0.9.51_0 builds on a clean install of Leopard 10.5.1 with no problems.

comment:2 Changed 12 years ago by ryandesign (Ryan Schmidt)

Resolution: fixed
Status: newclosed

I tested 0.9.52_0 on Leopard and it built with no problems too. So I'm going to call this fixed.

comment:3 Changed 11 years ago by (none)

Milestone: Port Bugs

Milestone Port Bugs deleted

Note: See TracTickets for help on using tickets.