Opened 13 years ago

Closed 13 years ago

#14495 closed defect (duplicate)

madplay-0.15.2b build error on 10.5.2

Reported by: rob@… Owned by: macports-tickets@…
Priority: Normal Milestone:
Component: ports Version: 1.6.0
Keywords: Cc:
Port:

Description

Build log:

sh-3.2# bin/port install madplay
--->  Fetching audiofile
--->  Attempting to fetch audiofile-0.2.6.tar.gz from http://www.68k.org/~michael/audiofile/
--->  Verifying checksum(s) for audiofile
--->  Extracting audiofile
--->  Configuring audiofile
--->  Building audiofile with target all
--->  Staging audiofile into destroot
--->  Installing audiofile 0.2.6_1
--->  Activating audiofile 0.2.6_1
--->  Cleaning audiofile
--->  Fetching pkgconfig
--->  Attempting to fetch pkg-config-0.23.tar.gz from http://pkg-config.freedesktop.org/releases/
--->  Verifying checksum(s) for pkgconfig
--->  Extracting pkgconfig
--->  Configuring pkgconfig
--->  Building pkgconfig with target all
--->  Staging pkgconfig into destroot
--->  Installing pkgconfig 0.23_0
--->  Activating pkgconfig 0.23_0
--->  Cleaning pkgconfig
--->  Fetching esound
--->  Attempting to fetch esound-0.2.38.tar.bz2 from http://mandril.creatis.insa-lyon.fr/linux/gnome.org/sources/esound/0.2/
--->  Verifying checksum(s) for esound
--->  Extracting esound
--->  Applying patches to esound
--->  Configuring esound
--->  Building esound with target all
--->  Staging esound into destroot
--->  Installing esound 0.2.38_1
--->  Activating esound 0.2.38_1
--->  Cleaning esound
--->  Fetching expat
--->  Attempting to fetch expat-2.0.1.tar.gz from http://downloads.sourceforge.net/expat
--->  Verifying checksum(s) for expat
--->  Extracting expat
--->  Configuring expat
--->  Building expat with target all
--->  Staging expat into destroot
--->  Installing expat 2.0.1_0
--->  Activating expat 2.0.1_0
--->  Cleaning expat
--->  Fetching gettext
--->  Attempting to fetch gettext-0.17.tar.gz from http://ftp.gnu.org/gnu/gettext
--->  Verifying checksum(s) for gettext
--->  Extracting gettext
--->  Applying patches to gettext
--->  Configuring gettext
--->  Building gettext with target all
--->  Staging gettext into destroot
--->  Installing gettext 0.17_3
--->  Activating gettext 0.17_3
--->  Cleaning gettext
--->  Fetching libid3tag
--->  Attempting to fetch libid3tag-0.15.1b.tar.gz from ftp://ftp.mars.org/pub/mpeg/
--->  Verifying checksum(s) for libid3tag
--->  Extracting libid3tag
--->  Configuring libid3tag
--->  Building libid3tag with target all
--->  Staging libid3tag into destroot
--->  Installing libid3tag 0.15.1b_0
--->  Activating libid3tag 0.15.1b_0
--->  Cleaning libid3tag
--->  Fetching libmad
--->  Attempting to fetch libmad-0.15.1b.tar.gz from ftp://ftp.mars.org/pub/mpeg/
--->  Verifying checksum(s) for libmad
--->  Extracting libmad
--->  Configuring libmad
--->  Building libmad with target all
--->  Staging libmad into destroot
--->  Installing libmad 0.15.1b_1
--->  Activating libmad 0.15.1b_1
--->  Cleaning libmad
--->  Fetching madplay
--->  Attempting to fetch madplay-0.15.2b.tar.gz from ftp://ftp.mars.org/pub/mpeg/
--->  Verifying checksum(s) for madplay
--->  Extracting madplay
--->  Applying patches to madplay
--->  Configuring madplay
--->  Building madplay with target all
Error: Target org.macports.build returned: shell command " cd "/opt/local/var/macports/build/_opt_local_var_macports_sources_rsync.macports.org_release_ports_audio_madplay/work/madplay-0.15.2b" && make all " returned error 2
Command output: In file included from /System/Library/Frameworks/CoreServices.framework/Frameworks/CarbonCore.framework/Headers/MachineExceptions.h:29,
                 from /System/Library/Frameworks/CoreServices.framework/Frameworks/CarbonCore.framework/Headers/DriverServices.h:32,
                 from /System/Library/Frameworks/CoreServices.framework/Frameworks/CarbonCore.framework/Headers/CarbonCore.h:125,
                 from /System/Library/Frameworks/CoreServices.framework/Frameworks/AE.framework/Headers/AE.h:20,
                 from /System/Library/Frameworks/CoreServices.framework/Headers/CoreServices.h:21,
                 from /System/Library/Frameworks/Carbon.framework/Headers/Carbon.h:20,
                 from audio_carbon.c:28:
/usr/lib/gcc/i686-apple-darwin9/4.0.1/include/xmmintrin.h:35:3: error: #error "SSE instruction set not enabled"
In file included from /System/Library/Frameworks/CoreServices.framework/Frameworks/CarbonCore.framework/Headers/DriverServices.h:32,
                 from /System/Library/Frameworks/CoreServices.framework/Frameworks/CarbonCore.framework/Headers/CarbonCore.h:125,
                 from /System/Library/Frameworks/CoreServices.framework/Frameworks/AE.framework/Headers/AE.h:20,
                 from /System/Library/Frameworks/CoreServices.framework/Headers/CoreServices.h:21,
                 from /System/Library/Frameworks/Carbon.framework/Headers/Carbon.h:20,
                 from audio_carbon.c:28:
/System/Library/Frameworks/CoreServices.framework/Frameworks/CarbonCore.framework/Headers/MachineExceptions.h:216: error: syntax error before '__m128'
/System/Library/Frameworks/CoreServices.framework/Frameworks/CarbonCore.framework/Headers/MachineExceptions.h:218: error: syntax error before 'sd'
/System/Library/Frameworks/CoreServices.framework/Frameworks/CarbonCore.framework/Headers/MachineExceptions.h:220: error: syntax error before '}' token
/System/Library/Frameworks/CoreServices.framework/Frameworks/CarbonCore.framework/Headers/MachineExceptions.h:264: error: array type has incomplete element type
audio_carbon.c: In function 'soundcmd':
audio_carbon.c:71: warning: 'SndDoImmediate' is deprecated (declared at /System/Library/Frameworks/Carbon.framework/Frameworks/CarbonSound.framework/Headers/Sound.h:1412)
audio_carbon.c:78: warning: 'SndDoCommand' is deprecated (declared at /System/Library/Frameworks/Carbon.framework/Frameworks/CarbonSound.framework/Headers/Sound.h:1398)
audio_carbon.c: In function 'init':
audio_carbon.c:114: warning: 'SndNewChannel' is deprecated (declared at /System/Library/Frameworks/Carbon.framework/Frameworks/CarbonSound.framework/Headers/Sound.h:1428)
audio_carbon.c: In function 'queue':
audio_carbon.c:189: warning: pointer targets in passing argument 2 of 'init_header' differ in signedness
audio_carbon.c: In function 'finish':
audio_carbon.c:324: warning: 'SndDisposeChannel' is deprecated (declared at /System/Library/Frameworks/Carbon.framework/Frameworks/CarbonSound.framework/Headers/Sound.h:1442)
make[2]: *** [audio_carbon.o] Error 1
make[1]: *** [all-recursive] Error 1
make: *** [all] Error 2

Error: Status 1 encountered during processing.

Change History (2)

comment:1 Changed 13 years ago by rob@…

Sorry, think this is a duplicate, oops Rob

comment:2 Changed 13 years ago by afb@…

Resolution: duplicate
Status: newclosed

Dupe, #13175

Note: See TracTickets for help on using tickets.