Opened 17 years ago

Closed 17 years ago

Last modified 16 years ago

#1469 closed defect (worksforme)

BUG: openMotif fails to build on 10.3

Reported by: mww@… Owned by: jkh@…
Priority: Normal Milestone:
Component: ports Version: 1.0
Keywords: Cc:
Port:

Description

OS-X 10.3.2 using X11 & X11-SDK of MacOS

---> Building openMotif with target all Error: Target com.apple.build returned: shell command "cd "/opt/darwinports/dports/x11/ openMotif/work/openMotif-2.2.2" && make all" returned error 2 Command output: UilSymEnum.h:1740: error: (near initialization for `enumval_values_table_vec[270]') UilSymEnum.h:1741: error: `XmSCROLL_VERT' undeclared here (not in a function) UilSymEnum.h:1741: error: initializer element is not constant UilSymEnum.h:1741: error: (near initialization for `enumval_values_table_vec[271]') UilSymEnum.h:1810: error: `XmVERT_SCROLLBAR' undeclared here (not in a function) UilSymEnum.h:1810: error: initializer element is not constant UilSymEnum.h:1810: error: (near initialization for `enumval_values_table_vec[340]') In file included from wmldbcreate.c:95: UilSymCSet.h:14: error: `_MOTIF_DEFAULT_LOCALE' undeclared here (not in a function) UilSymCSet.h:14: error: initializer element is not constant UilSymCSet.h:14: error: (near initialization for `charset_xmstring_names_table_vec[3]') In file included from wmldbcreate.c:96: UilUrmClas.h:847: error: `XmNtoolTipEnable' undeclared here (not in a function) UilUrmClas.h:847: error: initializer element is not constant UilUrmClas.h:847: error: (near initialization for `uil_argument_toolkit_names_vec[517]') UilUrmClas.h:848: error: `XmNtoolTipPostDelay' undeclared here (not in a function) UilUrmClas.h:848: error: initializer element is not constant UilUrmClas.h:848: error: (near initialization for `uil_argument_toolkit_names_vec[518]') UilUrmClas.h:849: error: `XmNtoolTipPostDuration' undeclared here (not in a function) UilUrmClas.h:849: error: initializer element is not constant UilUrmClas.h:849: error: (near initialization for `uil_argument_toolkit_names_vec[519]') UilUrmClas.h:850: error: `XmNtoolTipString' undeclared here (not in a function) UilUrmClas.h:850: error: initializer element is not constant UilUrmClas.h:850: error: (near initialization for `uil_argument_toolkit_names_vec[520]') UilUrmClas.h:891: error: `XmNwrap' undeclared here (not in a function) UilUrmClas.h:891: error: initializer element is not constant UilUrmClas.h:891: error: (near initialization for `uil_argument_toolkit_names_vec[561]') make[2]: * [wmldbcreate.o] Error 1 make[1]: * [all-recursive] Error 1 make: * [all-recursive] Error 1

Change History (3)

comment:1 Changed 17 years ago by mww@…

blocked: 1464

comment:2 Changed 17 years ago by ssen@…

Builds for me on 10.3.2...

comment:3 Changed 17 years ago by mww@…

Resolution: worksforme
Status: newclosed

Rats. If it builds for you this must be the fault of my system... %$#!

Note: See TracTickets for help on using tickets.