Opened 13 years ago

Closed 13 years ago

Last modified 12 years ago

#16050 closed defect (invalid)

macports-notifier 0.1 build failure

Reported by: neal.dudley@… Owned by: rhwood@…
Priority: Normal Milestone:
Component: ports Version: 1.6.0
Keywords: macports-notifier build failure Cc: jmroot (Joshua Root)
Port:

Description

Build failure details:

port install macports-notifier
--->  Building macports-notifier
Error: Target org.macports.build returned: shell command "cd "/opt/local/var/macports/build/_opt_local_var_macports_sources_rsync.macports.org_release_ports_sysutils_macports-notifier/work/trunk" && xcodebuild  -target "PortsNotifier" -configuration Release build OBJROOT=build/ SYMROOT=build/ " returned error 1
Command output: === BUILDING NATIVE TARGET PortsHelper WITH CONFIGURATION Release ===

Checking Dependencies...


=== BUILDING NATIVE TARGET PortsNotifier WITH CONFIGURATION Release ===

Checking Dependencies...

CompileC build/PortsNotifier.build/Release/PortsNotifier.build/Objects-normal/i386/PNController.o /opt/local/var/macports/build/_opt_local_var_macports_sources_rsync.macports.org_release_ports_sysutils_macports-notifier/work/trunk/PNController.m normal i386 objective-c com.apple.compilers.gcc.4_0
    cd /opt/local/var/macports/build/_opt_local_var_macports_sources_rsync.macports.org_release_ports_sysutils_macports-notifier/work/trunk
    /Developer/usr/bin/gcc-4.0 -x objective-c -arch i386 -pipe -Wno-trigraphs -fpascal-strings -fasm-blocks -Os -mdynamic-no-pic -Wreturn-type -Wunused-variable -fmessage-length=0 -fvisibility=hidden "-I/opt/local/var/macports/build/_opt_local_var_macports_sources_rsync.macports.org_release_ports_sysutils_macports-notifier/work/trunk/build/PortsNotifier.build/Release/PortsNotifier.build/MacPorts Notifier.hmap" -F/opt/local/var/macports/build/_opt_local_var_macports_sources_rsync.macports.org_release_ports_sysutils_macports-notifier/work/trunk/build/Release -I/opt/local/var/macports/build/_opt_local_var_macports_sources_rsync.macports.org_release_ports_sysutils_macports-notifier/work/trunk/build/Release/include -I/opt/local/var/macports/build/_opt_local_var_macports_sources_rsync.macports.org_release_ports_sysutils_macports-notifier/work/trunk/build/PortsNotifier.build/Release/PortsNotifier.build/DerivedSources -include /Library/Caches/com.apple.Xcode.0/SharedPrecompiledHeaders/AppKit-chxrwxhwqxfmjeajnfkoanmzfent/AppKit.h -c /opt/local/var/macports/build/_opt_local_var_macports_sources_rsync.macports.org_release_ports_sysutils_macports-notifier/work/trunk/PNController.m -o /opt/local/var/macports/build/_opt_local_var_macports_sources_rsync.macports.org_release_ports_sysutils_macports-notifier/work/trunk/build/PortsNotifier.build/Release/PortsNotifier.build/Objects-normal/i386/PNController.o
cc1obj: error: /Library/Caches/com.apple.Xcode.0/SharedPrecompiledHeaders/AppKit-chxrwxhwqxfmjeajnfkoanmzfent/AppKit.h: No such file or directory
cc1obj: error: one or more PCH files were found, but they were invalid
cc1obj: error: use -Winvalid-pch for more information

CompileC build/PortsNotifier.build/Release/PortsNotifier.build/Objects-normal/i386/PNPortWrapper.o /opt/local/var/macports/build/_opt_local_var_macports_sources_rsync.macports.org_release_ports_sysutils_macports-notifier/work/trunk/PNPortWrapper.m normal i386 objective-c com.apple.compilers.gcc.4_0
    cd /opt/local/var/macports/build/_opt_local_var_macports_sources_rsync.macports.org_release_ports_sysutils_macports-notifier/work/trunk
    /Developer/usr/bin/gcc-4.0 -x objective-c -arch i386 -pipe -Wno-trigraphs -fpascal-strings -fasm-blocks -Os -mdynamic-no-pic -Wreturn-type -Wunused-variable -fmessage-length=0 -fvisibility=hidden "-I/opt/local/var/macports/build/_opt_local_var_macports_sources_rsync.macports.org_release_ports_sysutils_macports-notifier/work/trunk/build/PortsNotifier.build/Release/PortsNotifier.build/MacPorts Notifier.hmap" -F/opt/local/var/macports/build/_opt_local_var_macports_sources_rsync.macports.org_release_ports_sysutils_macports-notifier/work/trunk/build/Release -I/opt/local/var/macports/build/_opt_local_var_macports_sources_rsync.macports.org_release_ports_sysutils_macports-notifier/work/trunk/build/Release/include -I/opt/local/var/macports/build/_opt_local_var_macports_sources_rsync.macports.org_release_ports_sysutils_macports-notifier/work/trunk/build/PortsNotifier.build/Release/PortsNotifier.build/DerivedSources -include /Library/Caches/com.apple.Xcode.0/SharedPrecompiledHeaders/AppKit-chxrwxhwqxfmjeajnfkoanmzfent/AppKit.h -c /opt/local/var/macports/build/_opt_local_var_macports_sources_rsync.macports.org_release_ports_sysutils_macports-notifier/work/trunk/PNPortWrapper.m -o /opt/local/var/macports/build/_opt_local_var_macports_sources_rsync.macports.org_release_ports_sysutils_macports-notifier/work/trunk/build/PortsNotifier.build/Release/PortsNotifier.build/Objects-normal/i386/PNPortWrapper.o
cc1obj: error: /Library/Caches/com.apple.Xcode.0/SharedPrecompiledHeaders/AppKit-chxrwxhwqxfmjeajnfkoanmzfent/AppKit.h: No such file or directory
cc1obj: error: one or more PCH files were found, but they were invalid
cc1obj: error: use -Winvalid-pch for more information
** BUILD FAILED **

Error: Status 1 encountered during processing.

Change History (5)

comment:1 Changed 13 years ago by mf2k (Frank Schima)

Owner: changed from macports-tickets@… to rhwood@…

Assigning to maintainer.

comment:2 Changed 13 years ago by jmroot (Joshua Root)

Cc: jmr@… added

Looks like your XCode precompiled header cache is corrupt. Try emptying it.

comment:3 Changed 13 years ago by neal.dudley@…

That fixed the error. Thank you.

comment:4 Changed 13 years ago by jmroot (Joshua Root)

Resolution: invalid
Status: newclosed

comment:5 Changed 12 years ago by (none)

Milestone: Port Bugs

Milestone Port Bugs deleted

Note: See TracTickets for help on using tickets.