Opened 12 years ago

Closed 12 years ago

Last modified 11 years ago

#17622 closed defect (fixed)

kermit 8.0.211 Build Failure

Reported by: vaiha@… Owned by: macports-tickets@…
Priority: Normal Milestone:
Component: ports Version: 1.6.0
Keywords: Cc:
Port:

Description

used to be able to compile a couple of days ago.

new macports installation after clean uninstall

DEBUG: Found port in file:///opt/local/var/macports/sources/rsync.macports.org/release/ports/comms/kermit
DEBUG: Changing to port directory: /opt/local/var/macports/sources/rsync.macports.org/release/ports/comms/kermit
DEBUG: Requested variant i386 is not provided by port kermit.
DEBUG: Requested variant macosx is not provided by port kermit.
DEBUG: Executing variant darwin provides darwin
DEBUG: Executing org.macports.main (kermit)
--->  Fetching kermit
DEBUG: Executing org.macports.fetch (kermit)
--->  cku211.tar.gz doesn't seem to exist in /opt/local/var/macports/distfiles/kermit
--->  Attempting to fetch cku211.tar.gz from ftp://kermit.columbia.edu/kermit/archives/
  % Total    % Received % Xferd  Average Speed   Time    Time     Time  Current
                                 Dload  Upload   Total   Spent    Left  Speed
100 2811k  100 2811k    0     0  11793      0  0:04:04  0:04:04 --:--:-- 10891
--->  Verifying checksum(s) for kermit
DEBUG: Executing org.macports.checksum (kermit)
--->  Checksumming cku211.tar.gz
DEBUG: Correct (md5) checksum for cku211.tar.gz
DEBUG: Correct (sha1) checksum for cku211.tar.gz
DEBUG: Extracting to subdirectory worksrcdir
--->  Extracting kermit
DEBUG: Executing org.macports.extract (kermit)
--->  Extracting cku211.tar.gz
DEBUG: setting option extract.args to /opt/local/var/macports/distfiles/kermit/cku211.tar.gz
DEBUG: Environment: 
DEBUG: Assembled command: 'cd "/opt/local/var/macports/build/_opt_local_var_macports_sources_rsync.macports.org_release_ports_comms_kermit/work/cku211" && gzip -dc /opt/local/var/macports/distfiles/kermit/cku211.tar.gz | /usr/bin/gnutar --no-same-owner -xf -'
DEBUG: Executing org.macports.patch (kermit)
--->  Applying patches to kermit
--->  Applying /opt/local/var/macports/sources/rsync.macports.org/release/ports/comms/kermit/files/patch-makefile
DEBUG: Environment: 
DEBUG: Assembled command: 'cd "/opt/local/var/macports/build/_opt_local_var_macports_sources_rsync.macports.org_release_ports_comms_kermit/work/cku211" && patch -p0'
patching file makefile
--->  Applying /opt/local/var/macports/sources/rsync.macports.org/release/ports/comms/kermit/files/patch-ckuus5.c
DEBUG: Environment: 
DEBUG: Assembled command: 'cd "/opt/local/var/macports/build/_opt_local_var_macports_sources_rsync.macports.org_release_ports_comms_kermit/work/cku211" && patch -p0'
patching file ckuus5.c
Hunk #1 succeeded at 824 (offset 10 lines).
--->  Configuring kermit
DEBUG: Executing org.macports.configure (kermit)
--->  Building kermit with target macosx103
DEBUG: Executing org.macports.build (kermit)
DEBUG: Environment: 
DEBUG: Assembled command: 'cd "/opt/local/var/macports/build/_opt_local_var_macports_sources_rsync.macports.org_release_ports_comms_kermit/work/cku211" && make macosx103'
Making C-Kermit 8.0.211 for Darwin + ncurses...
make CC= CC2= xermit KTARGET=${KTARGET:-macosx103} \
	"CFLAGS+= -DMACOSX10 -DMACOSX103 -DCK_NCURSES -DTCPSOCKET \
	-DUSE_STRERROR -DUSE_NAMESER_COMPAT -O \
	-DLOCK_DIR=\\\"/tmp\\\"  " "LIBS= -lncurses -lresolv "
DMACOSX10 -DMACOSX103 -DCK_NCURSES -DTCPSOCKET -DUSE_STRERROR -DUSE_NAMESER_COMPAT -O -DLOCK_DIR=\"/tmp\"   -DKTARGET=\"macosx103\" -c ckcmai.c
make[1]: DMACOSX10: Command not found
make[1]: [ckcmai.o] Error 127 (ignored)
DMACOSX10 -DMACOSX103 -DCK_NCURSES -DTCPSOCKET -DUSE_STRERROR -DUSE_NAMESER_COMPAT -O -DLOCK_DIR=\"/tmp\"   -DKTARGET=\"macosx103\" -c ckclib.c
make[1]: DMACOSX10: Command not found
make[1]: [ckclib.o] Error 127 (ignored)
DMACOSX10 -DMACOSX103 -DCK_NCURSES -DTCPSOCKET -DUSE_STRERROR -DUSE_NAMESER_COMPAT -O -DLOCK_DIR=\"/tmp\"   -DKTARGET=\"macosx103\" -c ckucmd.c
make[1]: DMACOSX10: Command not found
make[1]: [ckucmd.o] Error 127 (ignored)
DMACOSX10 -DMACOSX103 -DCK_NCURSES -DTCPSOCKET -DUSE_STRERROR -DUSE_NAMESER_COMPAT -O -DLOCK_DIR=\"/tmp\"   -DKTARGET=\"macosx103\" -c ckuusr.c
make[1]: DMACOSX10: Command not found
make[1]: [ckuusr.o] Error 127 (ignored)
DMACOSX10 -DMACOSX103 -DCK_NCURSES -DTCPSOCKET -DUSE_STRERROR -DUSE_NAMESER_COMPAT -O -DLOCK_DIR=\"/tmp\"   -DKTARGET=\"macosx103\" -c ckuus2.c
make[1]: DMACOSX10: Command not found
make[1]: [ckuus2.o] Error 127 (ignored)
DMACOSX10 -DMACOSX103 -DCK_NCURSES -DTCPSOCKET -DUSE_STRERROR -DUSE_NAMESER_COMPAT -O -DLOCK_DIR=\"/tmp\"   -DKTARGET=\"macosx103\" -c ckuus3.c
make[1]: DMACOSX10: Command not found
make[1]: [ckuus3.o] Error 127 (ignored)
DMACOSX10 -DMACOSX103 -DCK_NCURSES -DTCPSOCKET -DUSE_STRERROR -DUSE_NAMESER_COMPAT -O -DLOCK_DIR=\"/tmp\"   -DKTARGET=\"macosx103\" -c ckuus4.c
make[1]: DMACOSX10: Command not found
make[1]: [ckuus4.o] Error 127 (ignored)
DMACOSX10 -DMACOSX103 -DCK_NCURSES -DTCPSOCKET -DUSE_STRERROR -DUSE_NAMESER_COMPAT -O -DLOCK_DIR=\"/tmp\"   -DKTARGET=\"macosx103\" -c ckuus5.c
make[1]: DMACOSX10: Command not found
make[1]: [ckuus5.o] Error 127 (ignored)
DMACOSX10 -DMACOSX103 -DCK_NCURSES -DTCPSOCKET -DUSE_STRERROR -DUSE_NAMESER_COMPAT -O -DLOCK_DIR=\"/tmp\"   -DKTARGET=\"macosx103\" -c ckuus6.c
make[1]: DMACOSX10: Command not found
make[1]: [ckuus6.o] Error 127 (ignored)
DMACOSX10 -DMACOSX103 -DCK_NCURSES -DTCPSOCKET -DUSE_STRERROR -DUSE_NAMESER_COMPAT -O -DLOCK_DIR=\"/tmp\"   -DKTARGET=\"macosx103\" -c ckuus7.c
make[1]: DMACOSX10: Command not found
make[1]: [ckuus7.o] Error 127 (ignored)
DMACOSX10 -DMACOSX103 -DCK_NCURSES -DTCPSOCKET -DUSE_STRERROR -DUSE_NAMESER_COMPAT -O -DLOCK_DIR=\"/tmp\"   -DKTARGET=\"macosx103\" -c ckuusx.c
make[1]: DMACOSX10: Command not found
make[1]: [ckuusx.o] Error 127 (ignored)
DMACOSX10 -DMACOSX103 -DCK_NCURSES -DTCPSOCKET -DUSE_STRERROR -DUSE_NAMESER_COMPAT -O -DLOCK_DIR=\"/tmp\"   -DKTARGET=\"macosx103\" -c ckuusy.c
make[1]: DMACOSX10: Command not found
make[1]: [ckuusy.o] Error 127 (ignored)
DMACOSX10 -DMACOSX103 -DCK_NCURSES -DTCPSOCKET -DUSE_STRERROR -DUSE_NAMESER_COMPAT -O -DLOCK_DIR=\"/tmp\"   -DKTARGET=\"macosx103\" -c ckwart.c
make[1]: DMACOSX10: Command not found
make[1]: [ckwart.o] Error 127 (ignored)
o wart ckwart.o -lncurses -lresolv 
make[1]: o: Command not found
make[1]: [wart] Error 127 (ignored)
./wart ckcpro.w ckcpro.c
make[1]: ./wart: Command not found
make[1]: *** [ckcpro.c] Error 127
make: *** [macosx103] Error 2
Error: Target org.macports.build returned: shell command " cd "/opt/local/var/macports/build/_opt_local_var_macports_sources_rsync.macports.org_release_ports_comms_kermit/work/cku211" && make macosx103 " returned error 2
Command output: make[1]: DMACOSX10: Command not found
make[1]: [ckuus3.o] Error 127 (ignored)
DMACOSX10 -DMACOSX103 -DCK_NCURSES -DTCPSOCKET -DUSE_STRERROR -DUSE_NAMESER_COMPAT -O -DLOCK_DIR=\"/tmp\"   -DKTARGET=\"macosx103\" -c ckuus4.c
make[1]: DMACOSX10: Command not found
make[1]: [ckuus4.o] Error 127 (ignored)
DMACOSX10 -DMACOSX103 -DCK_NCURSES -DTCPSOCKET -DUSE_STRERROR -DUSE_NAMESER_COMPAT -O -DLOCK_DIR=\"/tmp\"   -DKTARGET=\"macosx103\" -c ckuus5.c
make[1]: DMACOSX10: Command not found
make[1]: [ckuus5.o] Error 127 (ignored)
DMACOSX10 -DMACOSX103 -DCK_NCURSES -DTCPSOCKET -DUSE_STRERROR -DUSE_NAMESER_COMPAT -O -DLOCK_DIR=\"/tmp\"   -DKTARGET=\"macosx103\" -c ckuus6.c
make[1]: DMACOSX10: Command not found
make[1]: [ckuus6.o] Error 127 (ignored)
DMACOSX10 -DMACOSX103 -DCK_NCURSES -DTCPSOCKET -DUSE_STRERROR -DUSE_NAMESER_COMPAT -O -DLOCK_DIR=\"/tmp\"   -DKTARGET=\"macosx103\" -c ckuus7.c
make[1]: DMACOSX10: Command not found
make[1]: [ckuus7.o] Error 127 (ignored)
DMACOSX10 -DMACOSX103 -DCK_NCURSES -DTCPSOCKET -DUSE_STRERROR -DUSE_NAMESER_COMPAT -O -DLOCK_DIR=\"/tmp\"   -DKTARGET=\"macosx103\" -c ckuusx.c
make[1]: DMACOSX10: Command not found
make[1]: [ckuusx.o] Error 127 (ignored)
DMACOSX10 -DMACOSX103 -DCK_NCURSES -DTCPSOCKET -DUSE_STRERROR -DUSE_NAMESER_COMPAT -O -DLOCK_DIR=\"/tmp\"   -DKTARGET=\"macosx103\" -c ckuusy.c
make[1]: DMACOSX10: Command not found
make[1]: [ckuusy.o] Error 127 (ignored)
DMACOSX10 -DMACOSX103 -DCK_NCURSES -DTCPSOCKET -DUSE_STRERROR -DUSE_NAMESER_COMPAT -O -DLOCK_DIR=\"/tmp\"   -DKTARGET=\"macosx103\" -c ckwart.c
make[1]: DMACOSX10: Command not found
make[1]: [ckwart.o] Error 127 (ignored)
o wart ckwart.o -lncurses -lresolv 
make[1]: o: Command not found
make[1]: [wart] Error 127 (ignored)
./wart ckcpro.w ckcpro.c
make[1]: ./wart: Command not found
make[1]: *** [ckcpro.c] Error 127
make: *** [macosx103] Error 2

Warning: the following items did not execute (for kermit): org.macports.activate org.macports.build org.macports.destroot org.macports.install
Error: Status 1 encountered during processing.

Change History (4)

comment:1 Changed 12 years ago by blb@…

Priority: HighNormal

Looks like the Tcl env bug; try sudo port clean --work kermit then try the install again.

comment:2 Changed 12 years ago by vaiha@…

same problem after clean --work

DEBUG: Found port in file:///opt/local/var/macports/sources/rsync.macports.org/release/ports/comms/kermit
DEBUG: Changing to port directory: /opt/local/var/macports/sources/rsync.macports.org/release/ports/comms/kermit
DEBUG: Requested variant i386 is not provided by port kermit.
DEBUG: Requested variant macosx is not provided by port kermit.
DEBUG: Executing variant darwin provides darwin
DEBUG: Executing org.macports.main (kermit)
--->  Fetching kermit
DEBUG: Executing org.macports.fetch (kermit)
--->  Verifying checksum(s) for kermit
DEBUG: Executing org.macports.checksum (kermit)
--->  Checksumming cku211.tar.gz
DEBUG: Correct (md5) checksum for cku211.tar.gz
DEBUG: Correct (sha1) checksum for cku211.tar.gz
DEBUG: Extracting to subdirectory worksrcdir
--->  Extracting kermit
DEBUG: Executing org.macports.extract (kermit)
--->  Extracting cku211.tar.gz
DEBUG: setting option extract.args to /opt/local/var/macports/distfiles/kermit/cku211.tar.gz
DEBUG: Environment: 
DEBUG: Assembled command: 'cd "/opt/local/var/macports/build/_opt_local_var_macports_sources_rsync.macports.org_release_ports_comms_kermit/work/cku211" && gzip -dc /opt/local/var/macports/distfiles/kermit/cku211.tar.gz | /usr/bin/gnutar --no-same-owner -xf -'
DEBUG: Executing org.macports.patch (kermit)
--->  Applying patches to kermit
--->  Applying /opt/local/var/macports/sources/rsync.macports.org/release/ports/comms/kermit/files/patch-makefile
DEBUG: Environment: 
DEBUG: Assembled command: 'cd "/opt/local/var/macports/build/_opt_local_var_macports_sources_rsync.macports.org_release_ports_comms_kermit/work/cku211" && patch -p0'
patching file makefile
--->  Applying /opt/local/var/macports/sources/rsync.macports.org/release/ports/comms/kermit/files/patch-ckuus5.c
DEBUG: Environment: 
DEBUG: Assembled command: 'cd "/opt/local/var/macports/build/_opt_local_var_macports_sources_rsync.macports.org_release_ports_comms_kermit/work/cku211" && patch -p0'
patching file ckuus5.c
Hunk #1 succeeded at 824 (offset 10 lines).
--->  Configuring kermit
DEBUG: Executing org.macports.configure (kermit)
--->  Building kermit with target macosx103
DEBUG: Executing org.macports.build (kermit)
DEBUG: Environment: 
DEBUG: Assembled command: 'cd "/opt/local/var/macports/build/_opt_local_var_macports_sources_rsync.macports.org_release_ports_comms_kermit/work/cku211" && make macosx103'
Making C-Kermit 8.0.211 for Darwin + ncurses...
make CC= CC2= xermit KTARGET=${KTARGET:-macosx103} \
	"CFLAGS+= -DMACOSX10 -DMACOSX103 -DCK_NCURSES -DTCPSOCKET \
	-DUSE_STRERROR -DUSE_NAMESER_COMPAT -O \
	-DLOCK_DIR=\\\"/tmp\\\"  " "LIBS= -lncurses -lresolv "
DMACOSX10 -DMACOSX103 -DCK_NCURSES -DTCPSOCKET -DUSE_STRERROR -DUSE_NAMESER_COMPAT -O -DLOCK_DIR=\"/tmp\"   -DKTARGET=\"macosx103\" -c ckcmai.c
make[1]: DMACOSX10: Command not found
make[1]: [ckcmai.o] Error 127 (ignored)
DMACOSX10 -DMACOSX103 -DCK_NCURSES -DTCPSOCKET -DUSE_STRERROR -DUSE_NAMESER_COMPAT -O -DLOCK_DIR=\"/tmp\"   -DKTARGET=\"macosx103\" -c ckclib.c
make[1]: DMACOSX10: Command not found
make[1]: [ckclib.o] Error 127 (ignored)
DMACOSX10 -DMACOSX103 -DCK_NCURSES -DTCPSOCKET -DUSE_STRERROR -DUSE_NAMESER_COMPAT -O -DLOCK_DIR=\"/tmp\"   -DKTARGET=\"macosx103\" -c ckucmd.c
make[1]: DMACOSX10: Command not found
make[1]: [ckucmd.o] Error 127 (ignored)
DMACOSX10 -DMACOSX103 -DCK_NCURSES -DTCPSOCKET -DUSE_STRERROR -DUSE_NAMESER_COMPAT -O -DLOCK_DIR=\"/tmp\"   -DKTARGET=\"macosx103\" -c ckuusr.c
make[1]: DMACOSX10: Command not found
make[1]: [ckuusr.o] Error 127 (ignored)
DMACOSX10 -DMACOSX103 -DCK_NCURSES -DTCPSOCKET -DUSE_STRERROR -DUSE_NAMESER_COMPAT -O -DLOCK_DIR=\"/tmp\"   -DKTARGET=\"macosx103\" -c ckuus2.c
make[1]: DMACOSX10: Command not found
make[1]: [ckuus2.o] Error 127 (ignored)
DMACOSX10 -DMACOSX103 -DCK_NCURSES -DTCPSOCKET -DUSE_STRERROR -DUSE_NAMESER_COMPAT -O -DLOCK_DIR=\"/tmp\"   -DKTARGET=\"macosx103\" -c ckuus3.c
make[1]: DMACOSX10: Command not found
make[1]: [ckuus3.o] Error 127 (ignored)
DMACOSX10 -DMACOSX103 -DCK_NCURSES -DTCPSOCKET -DUSE_STRERROR -DUSE_NAMESER_COMPAT -O -DLOCK_DIR=\"/tmp\"   -DKTARGET=\"macosx103\" -c ckuus4.c
make[1]: DMACOSX10: Command not found
make[1]: [ckuus4.o] Error 127 (ignored)
DMACOSX10 -DMACOSX103 -DCK_NCURSES -DTCPSOCKET -DUSE_STRERROR -DUSE_NAMESER_COMPAT -O -DLOCK_DIR=\"/tmp\"   -DKTARGET=\"macosx103\" -c ckuus5.c
make[1]: DMACOSX10: Command not found
make[1]: [ckuus5.o] Error 127 (ignored)
DMACOSX10 -DMACOSX103 -DCK_NCURSES -DTCPSOCKET -DUSE_STRERROR -DUSE_NAMESER_COMPAT -O -DLOCK_DIR=\"/tmp\"   -DKTARGET=\"macosx103\" -c ckuus6.c
make[1]: DMACOSX10: Command not found
make[1]: [ckuus6.o] Error 127 (ignored)
DMACOSX10 -DMACOSX103 -DCK_NCURSES -DTCPSOCKET -DUSE_STRERROR -DUSE_NAMESER_COMPAT -O -DLOCK_DIR=\"/tmp\"   -DKTARGET=\"macosx103\" -c ckuus7.c
make[1]: DMACOSX10: Command not found
make[1]: [ckuus7.o] Error 127 (ignored)
DMACOSX10 -DMACOSX103 -DCK_NCURSES -DTCPSOCKET -DUSE_STRERROR -DUSE_NAMESER_COMPAT -O -DLOCK_DIR=\"/tmp\"   -DKTARGET=\"macosx103\" -c ckuusx.c
make[1]: DMACOSX10: Command not found
make[1]: [ckuusx.o] Error 127 (ignored)
DMACOSX10 -DMACOSX103 -DCK_NCURSES -DTCPSOCKET -DUSE_STRERROR -DUSE_NAMESER_COMPAT -O -DLOCK_DIR=\"/tmp\"   -DKTARGET=\"macosx103\" -c ckuusy.c
make[1]: DMACOSX10: Command not found
make[1]: [ckuusy.o] Error 127 (ignored)
DMACOSX10 -DMACOSX103 -DCK_NCURSES -DTCPSOCKET -DUSE_STRERROR -DUSE_NAMESER_COMPAT -O -DLOCK_DIR=\"/tmp\"   -DKTARGET=\"macosx103\" -c ckwart.c
make[1]: DMACOSX10: Command not found
make[1]: [ckwart.o] Error 127 (ignored)
o wart ckwart.o -lncurses -lresolv 
make[1]: o: Command not found
make[1]: [wart] Error 127 (ignored)
./wart ckcpro.w ckcpro.c
make[1]: ./wart: Command not found
make[1]: *** [ckcpro.c] Error 127
make: *** [macosx103] Error 2
Error: Target org.macports.build returned: shell command " cd "/opt/local/var/macports/build/_opt_local_var_macports_sources_rsync.macports.org_release_ports_comms_kermit/work/cku211" && make macosx103 " returned error 2
Command output: make[1]: DMACOSX10: Command not found
make[1]: [ckuus3.o] Error 127 (ignored)
DMACOSX10 -DMACOSX103 -DCK_NCURSES -DTCPSOCKET -DUSE_STRERROR -DUSE_NAMESER_COMPAT -O -DLOCK_DIR=\"/tmp\"   -DKTARGET=\"macosx103\" -c ckuus4.c
make[1]: DMACOSX10: Command not found
make[1]: [ckuus4.o] Error 127 (ignored)
DMACOSX10 -DMACOSX103 -DCK_NCURSES -DTCPSOCKET -DUSE_STRERROR -DUSE_NAMESER_COMPAT -O -DLOCK_DIR=\"/tmp\"   -DKTARGET=\"macosx103\" -c ckuus5.c
make[1]: DMACOSX10: Command not found
make[1]: [ckuus5.o] Error 127 (ignored)
DMACOSX10 -DMACOSX103 -DCK_NCURSES -DTCPSOCKET -DUSE_STRERROR -DUSE_NAMESER_COMPAT -O -DLOCK_DIR=\"/tmp\"   -DKTARGET=\"macosx103\" -c ckuus6.c
make[1]: DMACOSX10: Command not found
make[1]: [ckuus6.o] Error 127 (ignored)
DMACOSX10 -DMACOSX103 -DCK_NCURSES -DTCPSOCKET -DUSE_STRERROR -DUSE_NAMESER_COMPAT -O -DLOCK_DIR=\"/tmp\"   -DKTARGET=\"macosx103\" -c ckuus7.c
make[1]: DMACOSX10: Command not found
make[1]: [ckuus7.o] Error 127 (ignored)
DMACOSX10 -DMACOSX103 -DCK_NCURSES -DTCPSOCKET -DUSE_STRERROR -DUSE_NAMESER_COMPAT -O -DLOCK_DIR=\"/tmp\"   -DKTARGET=\"macosx103\" -c ckuusx.c
make[1]: DMACOSX10: Command not found
make[1]: [ckuusx.o] Error 127 (ignored)
DMACOSX10 -DMACOSX103 -DCK_NCURSES -DTCPSOCKET -DUSE_STRERROR -DUSE_NAMESER_COMPAT -O -DLOCK_DIR=\"/tmp\"   -DKTARGET=\"macosx103\" -c ckuusy.c
make[1]: DMACOSX10: Command not found
make[1]: [ckuusy.o] Error 127 (ignored)
DMACOSX10 -DMACOSX103 -DCK_NCURSES -DTCPSOCKET -DUSE_STRERROR -DUSE_NAMESER_COMPAT -O -DLOCK_DIR=\"/tmp\"   -DKTARGET=\"macosx103\" -c ckwart.c
make[1]: DMACOSX10: Command not found
make[1]: [ckwart.o] Error 127 (ignored)
o wart ckwart.o -lncurses -lresolv 
make[1]: o: Command not found
make[1]: [wart] Error 127 (ignored)
./wart ckcpro.w ckcpro.c
make[1]: ./wart: Command not found
make[1]: *** [ckcpro.c] Error 127
make: *** [macosx103] Error 2

Warning: the following items did not execute (for kermit): org.macports.activate org.macports.build org.macports.destroot org.macports.install
Error: Status 1 encountered during processing.

By the way i'm on macbook pro with 10.5.5 leopard

comment:3 Changed 12 years ago by blb@…

Resolution: fixed
Status: newclosed

Okay, it isn't the Tcl env bug, just happened to look like it. This should work as of r43651, so at least 30 minutes after I write this, run

sudo port clean --work kermit
sudo port sync

then the install should work fine.

comment:4 Changed 11 years ago by (none)

Milestone: Port Bugs

Milestone Port Bugs deleted

Note: See TracTickets for help on using tickets.