Opened 12 years ago

Closed 12 years ago

Last modified 11 years ago

#18510 closed defect (duplicate)

PORT install WINE - error

Reported by: jbu@… Owned by: macports-tickets@…
Priority: Normal Milestone:
Component: ports Version: 1.7.0
Keywords: Cc: jeremyhu (Jeremy Huddleston Sequoia)
Port: xorg-libX11

Description (last modified by mf2k (Frank Schima))

Hello, can you help me with this, please? Thanks, Jiri

> machome:~ Jirka$ sudo port install wine
> Password:
> --->  Building xorg-libX11
> Error: Target org.macports.build returned: shell command " cd
> "/opt/local/var/macports/build/_opt_local_var_macports_sources_rsync.macports.org_release_ports_x11_xorg-libX11/work/libX11-1.1.99.2" && make all "
> returned error 2
> Command output: Making all in include
> make[1]: Nothing to be done for `all'.
> Making all in modules
> Making all in im
> Making all in ximcp
> ../../../doltlibtool --tag=CC   --mode=link /usr/bin/gcc-4.0 -I../../../include -I../../../include/X11 -I../../../include -I../../../include/X11
> -I../../../src/xcms -I../../../src/xkb -I../../../src/xlibi18n -Wall -Wpointer-arith -Wstrict-prototypes   -Wmissing-prototypes -Wmissing-declarations
>    -Wnested-externs -fno-strict-aliasing -D_BSD_SOURCE -DHAS_FCHOWN -DHAS_STICKY_DIR_BIT -I/opt/local/include    -I/opt/local/include
> -I/opt/local/include   -I/opt/local/include   -I/opt/local/include   -DHASXDMAUTH -D_BSD_SOURCE -DXIM_t -DTRANS_CLIENT  -O2  -L/opt/local/lib -o
> libximcp.la  imCallbk.lo imDefFlt.lo imDefIc.lo imDefIm.lo imDefLkup.lo imDispch.lo imEvToWire.lo imExten.lo imImSw.lo imInsClbk.lo imInt.lo
> imLcFlt.lo imLcGIc.lo imLcIc.lo imLcIm.lo imLcLkup.lo imLcPrs.lo imLcSIc.lo imRmAttr.lo imRm.lo imThaiFlt.lo imThaiIc.lo imThaiIm.lo imTrans.lo
> imTransR.lo imTrX.lo
> ../../../doltlibtool: line 11: syntax error near unexpected token `"$arg"'
> ../../../doltlibtool: line 11: `        *) args+=("$arg")'
> make[3]: *** [libximcp.la] Error 2
> make[2]: *** [all-recursive] Error 1
> make[1]: *** [all-recursive] Error 1
> make: *** [all-recursive] Error 1
>
> Error: The following dependencies failed to build: xorg-libXcursor xorg-libXfixes xorg-libX11 xorg-renderproto xrender xorg-libXi xorg-libXext
> xorg-libXinerama xorg-xineramaproto xorg-libXrandr xorg-randrproto xorg-libXxf86vm xorg-xf86vidmodeproto xorg-libsm xorg-libice
> Error: Status 1 encountered during processing.

Change History (4)

comment:1 Changed 12 years ago by mf2k (Frank Schima)

Cc: jeremyhu@… added
Description: modified (diff)
Port: xorg-libX11 added

comment:2 Changed 12 years ago by mf2k (Frank Schima)

What version of Mac OS X are you running? What version of Xcode?

comment:3 Changed 12 years ago by jeremyhu (Jeremy Huddleston Sequoia)

Resolution: duplicate
Status: newclosed

Dupe: #18505

It's fixed already, so please sync up

comment:4 Changed 11 years ago by (none)

Milestone: Port Bugs

Milestone Port Bugs deleted

Note: See TracTickets for help on using tickets.