Opened 12 years ago

Closed 11 years ago

Last modified 11 years ago

#18933 closed defect (worksforme)

kdebase4-runtime build failure: Qt3Support/Q3PtrList: No such file or directory

Reported by: kalyaka@… Owned by: illogic-al@…
Priority: Normal Milestone:
Component: ports Version: 1.7.0
Keywords: kde43 Cc:
Port: kdebase4-runtime

Description

Hi! I'm trying to install kdebase4, but building ends with a compile error at kdebase4-runtime building. It seems that kdebase4-runtime needs qt4-mac compiled with Qt3 support, but I don't see any variant of qt4-mac with Qt3 support.

port -v install kdebase4
...
--->  Building kdebase4-runtime
...
In file included from /opt/local/var/macports/build/_opt_local_var_macports_sources_rsync.macports.org_release_ports_kde_kdebase4-runtime/work/kdebase-runtime-4.2.0/kpasswdserver/kpasswdserver.cpp:25:
/opt/local/var/macports/build/_opt_local_var_macports_sources_rsync.macports.org_release_ports_kde_kdebase4-runtime/work/kdebase-runtime-4.2.0/kpasswdserver/kpasswdserver.h:28:32: error: Qt3Support/Q3PtrList: No such file or directory
In file included from /opt/local/var/macports/build/_opt_local_var_macports_sources_rsync.macports.org_release_ports_kde_kdebase4-runtime/work/kdebase-runtime-4.2.0/kpasswdserver/kpasswdserver.cpp:25:
/opt/local/var/macports/build/_opt_local_var_macports_sources_rsync.macports.org_release_ports_kde_kdebase4-runtime/work/kdebase-runtime-4.2.0/kpasswdserver/kpasswdserver.h:82: error: expected template-name before '<' token
/opt/local/var/macports/build/_opt_local_var_macports_sources_rsync.macports.org_release_ports_kde_kdebase4-runtime/work/kdebase-runtime-4.2.0/kpasswdserver/kpasswdserver.h:82: error: expected `{' before '<' token
/opt/local/var/macports/build/_opt_local_var_macports_sources_rsync.macports.org_release_ports_kde_kdebase4-runtime/work/kdebase-runtime-4.2.0/kpasswdserver/kpasswdserver.h:82: error: expected unqualified-id before '<' token
In file included from /opt/local/var/macports/build/_opt_local_var_macports_sources_rsync.macports.org_release_ports_kde_kdebase4-runtime/work/kdebase-runtime-4.2.0/kpasswdserver/kpasswdserver.cpp:787:
/opt/local/var/macports/build/_opt_local_var_macports_sources_rsync.macports.org_release_ports_kde_kdebase4-runtime/work/build/kpasswdserver/kpasswdserver.moc:97: error: expected `}' at end of input
In file included from /opt/local/var/macports/build/_opt_local_var_macports_sources_rsync.macports.org_release_ports_kde_kdebase4-runtime/work/kdebase-runtime-4.2.0/kpasswdserver/kpasswdserver.cpp:25:
/opt/local/var/macports/build/_opt_local_var_macports_sources_rsync.macports.org_release_ports_kde_kdebase4-runtime/work/kdebase-runtime-4.2.0/kpasswdserver/kpasswdserver.h:69: error: expected unqualified-id at end of input
make[2]: *** [kpasswdserver/CMakeFiles/kded_kpasswdserver.dir/kpasswdserver.o] Error 1
make[1]: *** [kpasswdserver/CMakeFiles/kded_kpasswdserver.dir/all] Error 2
make: *** [all] Error 2

Warning: the following items did not execute (for kdebase4-runtime): org.macports.activate org.macports.build org.macports.destroot org.macports.install
Error: The following dependencies failed to build: kdebase4-runtime
Error: Status 1 encountered during processing.

macbook:~ kalyaka$ port installed qt4-mac
The following ports are currently installed:
  qt4-mac @4.5.0_1+cocoa (active)

macbook:~ kalyaka$ port info qt4-mac
qt4-mac @4.5.0, Revision 1 (aqua)
Variants:    cocoa, mysql, noframework, odbc, psql, raster, sqlite2, universal

This is Qt, TrollTech's C++ toolkit for writing cross-platform GUI applications.
This version uses the native Aqua UI. For a X11 version, see qt4-x11.
Homepage:    http://www.trolltech.com/

Build Dependencies:   pkgconfig
Library Dependencies: zlib, tiff, libpng, libmng, jpeg, dbus, openssl, sqlite3
Platforms:            macosx
Maintainers:          erickt@macports.org clubjuggler@gmail.com
                      openmaintainer@macports.org
macbook:~ kalyaka$ port info kdebase4-runtime
kdebase4-runtime @4.2.0 (kde, kde4)
Variants:    debug, no_docs, samba, universal, xine

Provides data which is required by KDE4 applications. e.g. icons and mimetype
data.
Homepage:    http://www.kde.org

Build Dependencies:   cmake, automoc
Library Dependencies: doxygen, kdelibs4, qimageblitz, kdepimlibs4
Platforms:            darwin
Maintainers:          illogic-al@macports.org openmaintainer@macports.org

Change History (4)

comment:1 Changed 12 years ago by mf2k (Frank Schima)

Owner: changed from macports-tickets@… to illogic-al@…
Port: kdebase4 added; kdebase4-runtime removed

comment:2 Changed 12 years ago by (none)

Milestone: Port Bugs

Milestone Port Bugs deleted

comment:3 Changed 11 years ago by illogic-al@…

Resolution: worksforme
Status: newclosed

fi

comment:4 Changed 11 years ago by ryandesign (Ryan Schmidt)

Port: kdebase4-runtime added; kdebase4 removed
Summary: kde4base-runtime fails to buildkdebase4-runtime build failure: Qt3Support/Q3PtrList: No such file or directory

This has been reported again as #20362.

Note: See TracTickets for help on using tickets.