Opened 10 years ago

Closed 10 years ago

#20402 closed defect (fixed)

gst-python compile problem

Reported by: garaged@… Owned by: rmsfisher@…
Priority: Normal Milestone:
Component: ports Version: 1.7.1
Keywords: Cc:
Port: gst-python

Description (last modified by tobypeterson)

I tried to install gst-python, and it has some bug with the output on the end.

I put a try-except around the line that trows the error and I can compile it correctly, but I don't have a correct patch, don't know the code at all.

--->  Building gst-python
Error: Target org.macports.build returned: shell command " cd "/opt/local/var/macports/build/_opt_local_var_macports_sources_rsync.macports.org_release_ports_gnome_gst-python/work/gst-python-0.10.15" && make all " returned error 2
Command output: Making all in common
Making all in m4
Making all in codegen
Making all in gst
Making all in extend
Traceback (most recent call last):
  File "../codegen/codegen.py", line 1574, in <module>
    sys.exit(main(sys.argv))
  File "../codegen/codegen.py", line 1531, in main
    o = override.Overrides(arg, path=extendpath)
  File "/opt/local/var/macports/build/_opt_local_var_macports_sources_rsync.macports.org_release_ports_gnome_gst-python/work/gst-python-0.10.15/codegen/override.py", line 49, in __init__
    self.handle_file(filename)
  File "/opt/local/var/macports/build/_opt_local_var_macports_sources_rsync.macports.org_release_ports_gnome_gst-python/work/gst-python-0.10.15/codegen/override.py", line 92, in handle_file
    self.__parse_override(buf, startline, filename)
  File "/opt/local/var/macports/build/_opt_local_var_macports_sources_rsync.macports.org_release_ports_gnome_gst-python/work/gst-python-0.10.15/codegen/override.py", line 174, in __parse_override
    self.handle_file(filename)
  File "/opt/local/var/macports/build/_opt_local_var_macports_sources_rsync.macports.org_release_ports_gnome_gst-python/work/gst-python-0.10.15/codegen/override.py", line 92, in handle_file
    self.__parse_override(buf, startline, filename)
  File "/opt/local/var/macports/build/_opt_local_var_macports_sources_rsync.macports.org_release_ports_gnome_gst-python/work/gst-python-0.10.15/codegen/override.py", line 174, in __parse_override
    self.handle_file(filename)
  File "/opt/local/var/macports/build/_opt_local_var_macports_sources_rsync.macports.org_release_ports_gnome_gst-python/work/gst-python-0.10.15/codegen/override.py", line 92, in handle_file
    self.__parse_override(buf, startline, filename)
  File "/opt/local/var/macports/build/_opt_local_var_macports_sources_rsync.macports.org_release_ports_gnome_gst-python/work/gst-python-0.10.15/codegen/override.py", line 104, in __parse_override
    command = words[0]
IndexError: list index out of range
make[3]: *** [gst.c] Error 1
make[2]: *** [all-recursive] Error 1
make[1]: *** [all-recursive] Error 1
make: *** [all] Error 2

Error: Status 1 encountered during processing.

Change History (3)

comment:1 Changed 10 years ago by tobypeterson

Description: modified (diff)

comment:2 Changed 10 years ago by mf2k (Frank Schima)

Keywords: gst-python removed
Owner: changed from macports-tickets@… to rmsfisher@…
Port: gst-python added

comment:3 Changed 10 years ago by tobypeterson

Resolution: fixed
Status: newclosed
Note: See TracTickets for help on using tickets.