Changes between Initial Version and Version 2 of Ticket #20799


Ignore:
Timestamp:
Aug 24, 2009, 8:11:20 PM (12 years ago)
Author:
nerdling (Jeremy Lavergne)
Comment:

Legend:

Unmodified
Added
Removed
Modified
  • Ticket #20799

    • Property Cc eallik@… removed
    • Property Owner changed from macports-tickets@… to mww@…
    • Property Keywords snowleopard added
  • Ticket #20799 – Description

    initial v2  
    22
    33{{{
    4 $ sudo port install tk +quartz
    5 --->  Computing dependencies for tk
    6 --->  Fetching tk
    7 --->  Verifying checksum(s) for tk
    8 --->  Extracting tk
    9 --->  Configuring tk
    10 --->  Building tk
    11 Error: Target org.macports.build returned: shell command " cd "/opt/local/var/macports/build/_opt_local_var_macports_sources_rsync.macports.org_release_ports_x11_tk/work/tk8.5.6/unix" && /usr/bin/make -j2 all " returned error 2
    12 Command output: /opt/local/var/macports/build/_opt_local_var_macports_sources_rsync.macports.org_release_ports_x11_tk/work/tk8.5.6/unix/../macosx/tkMacOSXButton.c:1033: warning: implicit declaration of function 'ShowControl'
    13 /opt/local/var/macports/build/_opt_local_var_macports_sources_rsync.macports.org_release_ports_x11_tk/work/tk8.5.6/unix/../macosx/tkMacOSXButton.c:1037: warning: implicit declaration of function 'SetControlVisibility'
    14 /opt/local/var/macports/build/_opt_local_var_macports_sources_rsync.macports.org_release_ports_x11_tk/work/tk8.5.6/unix/../macosx/tkMacOSXButton.c:1038: warning: implicit declaration of function 'Draw1Control'
    15 /opt/local/var/macports/build/_opt_local_var_macports_sources_rsync.macports.org_release_ports_x11_tk/work/tk8.5.6/unix/../macosx/tkMacOSXButton.c:1044: warning: implicit declaration of function 'KillPicture'
    16 /opt/local/var/macports/build/_opt_local_var_macports_sources_rsync.macports.org_release_ports_x11_tk/work/tk8.5.6/unix/../macosx/tkMacOSXButton.c:1044: error: 'union <anonymous>' has no member named 'picture'
    17 /opt/local/var/macports/build/_opt_local_var_macports_sources_rsync.macports.org_release_ports_x11_tk/work/tk8.5.6/unix/../macosx/tkMacOSXButton.c: In function 'SetupBevelButton':
    18 /opt/local/var/macports/build/_opt_local_var_macports_sources_rsync.macports.org_release_ports_x11_tk/work/tk8.5.6/unix/../macosx/tkMacOSXButton.c:1107: error: 'union <anonymous>' has no member named 'picture'
    19 /opt/local/var/macports/build/_opt_local_var_macports_sources_rsync.macports.org_release_ports_x11_tk/work/tk8.5.6/unix/../macosx/tkMacOSXButton.c:1107: warning: implicit declaration of function 'OpenCPicture'
    20 /opt/local/var/macports/build/_opt_local_var_macports_sources_rsync.macports.org_release_ports_x11_tk/work/tk8.5.6/unix/../macosx/tkMacOSXButton.c:1108: error: 'union <anonymous>' has no member named 'picture'
    21 /opt/local/var/macports/build/_opt_local_var_macports_sources_rsync.macports.org_release_ports_x11_tk/work/tk8.5.6/unix/../macosx/tkMacOSXButton.c:1134: warning: implicit declaration of function 'ClosePicture'
    22 /opt/local/var/macports/build/_opt_local_var_macports_sources_rsync.macports.org_release_ports_x11_tk/work/tk8.5.6/unix/../macosx/tkMacOSXButton.c: At top level:
    23 /opt/local/var/macports/build/_opt_local_var_macports_sources_rsync.macports.org_release_ports_x11_tk/work/tk8.5.6/unix/../macosx/tkMacOSXButton.c:1238: error: expected declaration specifiers or '...' before 'ControlUserPaneBackgroundProcPtr'
    24 /opt/local/var/macports/build/_opt_local_var_macports_sources_rsync.macports.org_release_ports_x11_tk/work/tk8.5.6/unix/../macosx/tkMacOSXButton.c: In function 'SetUserPaneSetUpSpecialBackgroundProc':
    25 /opt/local/var/macports/build/_opt_local_var_macports_sources_rsync.macports.org_release_ports_x11_tk/work/tk8.5.6/unix/../macosx/tkMacOSXButton.c:1240: error: 'ControlUserPaneBackgroundUPP' undeclared (first use in this function)
    26 /opt/local/var/macports/build/_opt_local_var_macports_sources_rsync.macports.org_release_ports_x11_tk/work/tk8.5.6/unix/../macosx/tkMacOSXButton.c:1240: error: (Each undeclared identifier is reported only once
    27 /opt/local/var/macports/build/_opt_local_var_macports_sources_rsync.macports.org_release_ports_x11_tk/work/tk8.5.6/unix/../macosx/tkMacOSXButton.c:1240: error: for each function it appears in.)
    28 /opt/local/var/macports/build/_opt_local_var_macports_sources_rsync.macports.org_release_ports_x11_tk/work/tk8.5.6/unix/../macosx/tkMacOSXButton.c:1240: error: expected ';' before 'myControlUserPaneBackgroundUPP'
    29 /opt/local/var/macports/build/_opt_local_var_macports_sources_rsync.macports.org_release_ports_x11_tk/work/tk8.5.6/unix/../macosx/tkMacOSXButton.c:1242: error: 'myControlUserPaneBackgroundUPP' undeclared (first use in this function)
    30 /opt/local/var/macports/build/_opt_local_var_macports_sources_rsync.macports.org_release_ports_x11_tk/work/tk8.5.6/unix/../macosx/tkMacOSXButton.c:1242: warning: implicit declaration of function 'NewControlUserPaneBackgroundUPP'
    31 /opt/local/var/macports/build/_opt_local_var_macports_sources_rsync.macports.org_release_ports_x11_tk/work/tk8.5.6/unix/../macosx/tkMacOSXButton.c:1242: error: 'upp' undeclared (first use in this function)
    32 /opt/local/var/macports/build/_opt_local_var_macports_sources_rsync.macports.org_release_ports_x11_tk/work/tk8.5.6/unix/../macosx/tkMacOSXButton.c: In function 'UserPaneDraw':
    33 /opt/local/var/macports/build/_opt_local_var_macports_sources_rsync.macports.org_release_ports_x11_tk/work/tk8.5.6/unix/../macosx/tkMacOSXButton.c:1271: warning: implicit declaration of function 'GetControlReference'
    34 /opt/local/var/macports/build/_opt_local_var_macports_sources_rsync.macports.org_release_ports_x11_tk/work/tk8.5.6/unix/../macosx/tkMacOSXButton.c:1275: warning: implicit declaration of function 'GetPort'
    35 /opt/local/var/macports/build/_opt_local_var_macports_sources_rsync.macports.org_release_ports_x11_tk/work/tk8.5.6/unix/../macosx/tkMacOSXButton.c:1276: warning: implicit declaration of function 'GetControlBounds'
    36 /opt/local/var/macports/build/_opt_local_var_macports_sources_rsync.macports.org_release_ports_x11_tk/work/tk8.5.6/unix/../macosx/tkMacOSXButton.c:1278: warning: implicit declaration of function 'EraseRect'
    37 /opt/local/var/macports/build/_opt_local_var_macports_sources_rsync.macports.org_release_ports_x11_tk/work/tk8.5.6/unix/../macosx/tkMacOSXButton.c: At top level:
    38 /opt/local/var/macports/build/_opt_local_var_macports_sources_rsync.macports.org_release_ports_x11_tk/work/tk8.5.6/unix/../macosx/tkMacOSXButton.c:1301: error: expected declaration specifiers or '...' before 'ControlBackgroundPtr'
    39 /opt/local/var/macports/build/_opt_local_var_macports_sources_rsync.macports.org_release_ports_x11_tk/work/tk8.5.6/unix/../macosx/tkMacOSXButton.c: In function 'UserPaneBackgroundProc':
    40 /opt/local/var/macports/build/_opt_local_var_macports_sources_rsync.macports.org_release_ports_x11_tk/work/tk8.5.6/unix/../macosx/tkMacOSXButton.c:1305: error: 'info' undeclared (first use in this function)
    414make: *** [tkMacOSXButton.o] Error 1
    42 
    43 Error: Status 1 encountered during processing.
    445}}}