Opened 11 years ago

Closed 10 years ago

#22409 closed defect (worksforme)

Error in compiling/installing erlang

Reported by: mailsforabhinav@… Owned by: bfulgham@…
Priority: Normal Milestone:
Component: ports Version: 1.8.1
Keywords: Cc:
Port: erlang

Description (last modified by mf2k (Frank Schima))

Hi,

I came up across this problem while installing couchdb on my Mac OSX Leopard 10.5. Below is the error log while compiling erlang:

~sabhinav: make
cd erts && ERL_TOP=/Users/sabhinav/binaries/otp_src_R13B make NO_START_SCRIPTS=true  FLAVOR=
make -f i386-apple-darwin9.8.0/Makefile generate
make[3]: Nothing to be done for `generate'.
make -f i386-apple-darwin9.8.0/Makefile TYPE=opt
cd /Users/sabhinav/binaries/otp_src_R13B/erts/lib_src && make opt
make -f i386-apple-darwin9.8.0/Makefile TYPE=opt
make[5]: Nothing to be done for `all'.
make -f i386-apple-darwin9.8.0/Makefile TYPE=opt
make[5]: Nothing to be done for `all'.
make -f i386-apple-darwin9.8.0/Makefile TYPE=opt
make[5]: Nothing to be done for `all'.
gcc -mdynamic-no-pic -arch x86_64 -g -Os -pipe -no-cpp-precomp -I/Users/sabhinav/binaries/otp_src_R13B/erts/i386-apple-darwin9.8.0  -no-cpp-precomp   -DERTS_SMP -DHAVE_CONFIG_H -Wall -Wstrict-prototypes -Wmissing-prototypes -Wdeclaration-after-statement -DUSE_THREADS -D_THREAD_SAFE -D_REENTRANT  -Ii386-apple-darwin9.8.0/opt/smp -Ibeam -Isys/unix -Isys/common -Ii386-apple-darwin9.8.0 -Izlib -Ipcre -Ihipe -I../include/internal -I../include/internal/i386-apple-darwin9.8.0 -c hipe/hipe_amd64_glue.S -o obj/i386-apple-darwin9.8.0/opt/smp/hipe_amd64_glue.o
hipe/hipe_amd64_glue.S:59:Expected comma after segment-name
hipe/hipe_amd64_glue.S:65:Unknown pseudo-op: .global
hipe/hipe_amd64_glue.S:65:Rest of line ignored. 1st junk character valued 120 (x).
hipe/hipe_amd64_glue.S:66:Unknown pseudo-op: .global
hipe/hipe_amd64_glue.S:66:Rest of line ignored. 1st junk character valued 110 (n).
hipe/hipe_amd64_glue.S:121:Unknown pseudo-op: .global
hipe/hipe_amd64_glue.S:121:Rest of line ignored. 1st junk character valued 110 (n).
hipe/hipe_amd64_glue.S:131:Unknown pseudo-op: .global
hipe/hipe_amd64_glue.S:131:Rest of line ignored. 1st junk character valued 110 (n).
hipe/hipe_amd64_glue.S:174:Unknown pseudo-op: .global
hipe/hipe_amd64_glue.S:174:Rest of line ignored. 1st junk character valued 110 (n).
hipe/hipe_amd64_glue.S:187:Unknown pseudo-op: .global
hipe/hipe_amd64_glue.S:187:Rest of line ignored. 1st junk character valued 110 (n).
hipe/hipe_amd64_glue.S:200:Unknown pseudo-op: .global
hipe/hipe_amd64_glue.S:200:Rest of line ignored. 1st junk character valued 110 (n).
hipe/hipe_amd64_glue.S:213:Unknown pseudo-op: .global
hipe/hipe_amd64_glue.S:213:Rest of line ignored. 1st junk character valued 110 (n).
hipe/hipe_amd64_glue.S:225:Unknown pseudo-op: .global
hipe/hipe_amd64_glue.S:225:Rest of line ignored. 1st junk character valued 110 (n).
hipe/hipe_amd64_glue.S:240:Unknown pseudo-op: .global
hipe/hipe_amd64_glue.S:240:Rest of line ignored. 1st junk character valued 110 (n).
hipe/hipe_amd64_glue.S:249:Unknown pseudo-op: .global
hipe/hipe_amd64_glue.S:249:Rest of line ignored. 1st junk character valued 110 (n).
hipe/hipe_amd64_glue.S:260:Unknown pseudo-op: .global
hipe/hipe_amd64_glue.S:260:Rest of line ignored. 1st junk character valued 110 (n).
hipe/hipe_amd64_glue.S:278:Unknown pseudo-op: .global
hipe/hipe_amd64_glue.S:278:Rest of line ignored. 1st junk character valued 120 (x).
hipe/hipe_amd64_glue.S:295:Unknown pseudo-op: .global
hipe/hipe_amd64_glue.S:295:Rest of line ignored. 1st junk character valued 120 (x).
hipe/hipe_amd64_glue.S:308:Unknown pseudo-op: .global
hipe/hipe_amd64_glue.S:308:Rest of line ignored. 1st junk character valued 120 (x).
hipe/hipe_amd64_glue.S:318:Unknown pseudo-op: .global
hipe/hipe_amd64_glue.S:318:Rest of line ignored. 1st junk character valued 110 (n).
hipe/hipe_amd64_glue.S:323:Unknown pseudo-op: .global
hipe/hipe_amd64_glue.S:323:Rest of line ignored. 1st junk character valued 110 (n).
hipe/hipe_amd64_glue.S:324:Unknown pseudo-op: .global
hipe/hipe_amd64_glue.S:324:Rest of line ignored. 1st junk character valued 110 (n).
hipe/hipe_amd64_glue.S:325:Unknown pseudo-op: .global
hipe/hipe_amd64_glue.S:325:Rest of line ignored. 1st junk character valued 110 (n).
hipe/hipe_amd64_glue.S:326:Unknown pseudo-op: .global
hipe/hipe_amd64_glue.S:326:Rest of line ignored. 1st junk character valued 110 (n).
hipe/hipe_amd64_glue.S:359:Unknown pseudo-op: .global
hipe/hipe_amd64_glue.S:359:Rest of line ignored. 1st junk character valued 110 (n).
hipe/hipe_amd64_glue.S:360:Unknown pseudo-op: .global
hipe/hipe_amd64_glue.S:360:Rest of line ignored. 1st junk character valued 110 (n).
hipe/hipe_amd64_glue.S:361:Unknown pseudo-op: .global
hipe/hipe_amd64_glue.S:361:Rest of line ignored. 1st junk character valued 110 (n).
hipe/hipe_amd64_glue.S:397:Unknown pseudo-op: .global
hipe/hipe_amd64_glue.S:397:Rest of line ignored. 1st junk character valued 110 (n).
hipe/hipe_amd64_glue.S:410:Unknown pseudo-op: .global
hipe/hipe_amd64_glue.S:410:Rest of line ignored. 1st junk character valued 110 (n).
hipe/hipe_amd64_glue.S:427:Unknown pseudo-op: .global
hipe/hipe_amd64_glue.S:427:Rest of line ignored. 1st junk character valued 110 (n).
make[3]: *** [obj/i386-apple-darwin9.8.0/opt/smp/hipe_amd64_glue.o] Error 1
make[2]: *** [opt] Error 2
make[1]: *** [smp] Error 2
make: *** [emulator] Error 2

Change History (6)

comment:1 Changed 11 years ago by mailsforabhinav@…

Cc: mailsforabhinav@… added

Cc Me!

comment:2 Changed 11 years ago by mf2k (Frank Schima)

Cc: mailsforabhinav@… removed
Description: modified (diff)
Keywords: couchdb removed
Priority: HighNormal

comment:3 Changed 11 years ago by mf2k (Frank Schima)

Keywords: erlang removed
Owner: changed from macports-tickets@… to bfulgham@…
Port: erlang added; couchdb removed

comment:4 Changed 11 years ago by mailsforabhinav@…

Hi,

Any update on this? Is it possible to have erlang compiled/configured somehow?

Regards, Abhinav

comment:5 Changed 10 years ago by bfulgham@…

Do any of the updates in our handling of amd64 ASM stuff help at all?

If you could retry this experiment with R14B01 it would be a big help.

comment:6 Changed 10 years ago by bfulgham@…

Resolution: worksforme
Status: newclosed

Closing for lack of response. I believe this is working properly as of R14B03.

Please reopen if the problem persists.

Note: See TracTickets for help on using tickets.