Opened 10 years ago

Closed 9 years ago

#23439 closed defect (fixed)

Aide failes to compile - expected specifier-qualifier-list before 'off64_t'

Reported by: aernan@… Owned by: macports-tickets@…
Priority: Normal Milestone:
Component: ports Version: 1.8.2
Keywords: Cc:
Port: aide

Description (last modified by mf2k (Frank Schima))

unixnet-dhcp-29:~ earnan$ sudo port -d install aide
DEBUG: Changing to port directory: /opt/local/var/macports/sources/rsync.macports.org/release/ports/security/aide
DEBUG: OS darwin/10.2.0 (Mac OS X 10.6) arch i386
DEBUG: setting option os.universal_supported to yes
DEBUG: org.macports.load registered provides 'load', a pre-existing procedure. Target override will not be provided
DEBUG: org.macports.unload registered provides 'unload', a pre-existing procedure. Target override will not be provided
DEBUG: org.macports.distfiles registered provides 'distfiles', a pre-existing procedure. Target override will not be provided
DEBUG: adding the default universal variant
DEBUG: Reading variant descriptions from /opt/local/var/macports/sources/rsync.macports.org/release/ports/_resources/port1.0/variant_descriptions.conf
DEBUG: Requested variant darwin is not provided by port aide.
DEBUG: Requested variant i386 is not provided by port aide.
DEBUG: Requested variant macosx is not provided by port aide.
DEBUG: logging to /opt/local/var/macports/logs/aide/main.log
DEBUG: epoch: in tree: 0 installed: 0
DEBUG: mhash 0.9.9.9_0 exists in the ports tree
DEBUG: mhash 0.9.9.9_0  is the latest installed
DEBUG: mhash 0.9.9.9_0  is active
DEBUG: Merging existing variants  into variants
DEBUG: new fully merged portvariants: 
DEBUG: Changing to port directory: /opt/local/var/macports/sources/rsync.macports.org/release/ports/devel/mhash
DEBUG: OS darwin/10.2.0 (Mac OS X 10.6) arch i386
DEBUG: setting option os.universal_supported to yes
DEBUG: org.macports.load registered provides 'load', a pre-existing procedure. Target override will not be provided
DEBUG: org.macports.unload registered provides 'unload', a pre-existing procedure. Target override will not be provided
DEBUG: org.macports.distfiles registered provides 'distfiles', a pre-existing procedure. Target override will not be provided
DEBUG: adding the default universal variant
DEBUG: Reading variant descriptions from /opt/local/var/macports/sources/rsync.macports.org/release/ports/_resources/port1.0/variant_descriptions.conf
DEBUG: Requested variant darwin is not provided by port mhash.
DEBUG: Requested variant i386 is not provided by port mhash.
DEBUG: Requested variant macosx is not provided by port mhash.
DEBUG: No need to upgrade! mhash 0.9.9.9_0 >= mhash 0.9.9.9_0
DEBUG: epoch: in tree: 0 installed: 0
DEBUG: gettext 0.17_4 exists in the ports tree
DEBUG: gettext 0.17_4  is the latest installed
DEBUG: gettext 0.17_4  is active
DEBUG: Merging existing variants  into variants
DEBUG: new fully merged portvariants: 
DEBUG: Changing to port directory: /opt/local/var/macports/sources/rsync.macports.org/release/ports/devel/gettext
DEBUG: OS darwin/10.2.0 (Mac OS X 10.6) arch i386
DEBUG: setting option os.universal_supported to yes
DEBUG: org.macports.load registered provides 'load', a pre-existing procedure. Target override will not be provided
DEBUG: org.macports.unload registered provides 'unload', a pre-existing procedure. Target override will not be provided
DEBUG: org.macports.distfiles registered provides 'distfiles', a pre-existing procedure. Target override will not be provided
DEBUG: Using group file /opt/local/var/macports/sources/rsync.macports.org/release/ports/_resources/port1.0/group/muniversal-1.0.tcl
DEBUG: Reading variant descriptions from /opt/local/var/macports/sources/rsync.macports.org/release/ports/_resources/port1.0/variant_descriptions.conf
DEBUG: Using group file /opt/local/var/macports/sources/rsync.macports.org/release/ports/_resources/port1.0/group/archcheck-1.0.tcl
DEBUG: universal variant already exists, so not adding the default one
DEBUG: Requested variant darwin is not provided by port gettext.
DEBUG: Requested variant i386 is not provided by port gettext.
DEBUG: Requested variant macosx is not provided by port gettext.
DEBUG: epoch: in tree: 0 installed: 0
DEBUG: libiconv 1.13_0 exists in the ports tree
DEBUG: libiconv 1.13_0  is the latest installed
DEBUG: libiconv 1.13_0  is active
DEBUG: Merging existing variants  into variants
DEBUG: new fully merged portvariants: 
DEBUG: Changing to port directory: /opt/local/var/macports/sources/rsync.macports.org/release/ports/textproc/libiconv
DEBUG: OS darwin/10.2.0 (Mac OS X 10.6) arch i386
DEBUG: setting option os.universal_supported to yes
DEBUG: org.macports.load registered provides 'load', a pre-existing procedure. Target override will not be provided
DEBUG: org.macports.unload registered provides 'unload', a pre-existing procedure. Target override will not be provided
DEBUG: org.macports.distfiles registered provides 'distfiles', a pre-existing procedure. Target override will not be provided
DEBUG: Using group file /opt/local/var/macports/sources/rsync.macports.org/release/ports/_resources/port1.0/group/muniversal-1.0.tcl
DEBUG: Reading variant descriptions from /opt/local/var/macports/sources/rsync.macports.org/release/ports/_resources/port1.0/variant_descriptions.conf
DEBUG: universal variant already exists, so not adding the default one
DEBUG: Requested variant darwin is not provided by port libiconv.
DEBUG: Requested variant i386 is not provided by port libiconv.
DEBUG: Requested variant macosx is not provided by port libiconv.
DEBUG: epoch: in tree: 0 installed: 0
DEBUG: gperf 3.0.4_0 exists in the ports tree
DEBUG: gperf 3.0.4_0  is the latest installed
DEBUG: gperf 3.0.4_0  is active
DEBUG: Merging existing variants  into variants
DEBUG: new fully merged portvariants: 
DEBUG: Changing to port directory: /opt/local/var/macports/sources/rsync.macports.org/release/ports/devel/gperf
DEBUG: OS darwin/10.2.0 (Mac OS X 10.6) arch i386
DEBUG: setting option os.universal_supported to yes
DEBUG: org.macports.load registered provides 'load', a pre-existing procedure. Target override will not be provided
DEBUG: org.macports.unload registered provides 'unload', a pre-existing procedure. Target override will not be provided
DEBUG: org.macports.distfiles registered provides 'distfiles', a pre-existing procedure. Target override will not be provided
DEBUG: Using group file /opt/local/var/macports/sources/rsync.macports.org/release/ports/_resources/port1.0/group/muniversal-1.0.tcl
DEBUG: Reading variant descriptions from /opt/local/var/macports/sources/rsync.macports.org/release/ports/_resources/port1.0/variant_descriptions.conf
DEBUG: universal variant already exists, so not adding the default one
DEBUG: Requested variant darwin is not provided by port gperf.
DEBUG: Requested variant i386 is not provided by port gperf.
DEBUG: Requested variant macosx is not provided by port gperf.
DEBUG: No need to upgrade! gperf 3.0.4_0 >= gperf 3.0.4_0
DEBUG: No need to upgrade! libiconv 1.13_0 >= libiconv 1.13_0
DEBUG: epoch: in tree: 0 installed: 0
DEBUG: ncurses 5.7_0 exists in the ports tree
DEBUG: ncurses 5.7_0 +darwin_10 is the latest installed
DEBUG: ncurses 5.7_0 +darwin_10 is active
DEBUG: Merging existing variants darwin_10 into variants
DEBUG: new fully merged portvariants: 
DEBUG: Changing to port directory: /opt/local/var/macports/sources/rsync.macports.org/release/ports/devel/ncurses
DEBUG: OS darwin/10.2.0 (Mac OS X 10.6) arch i386
DEBUG: setting option os.universal_supported to yes
DEBUG: org.macports.load registered provides 'load', a pre-existing procedure. Target override will not be provided
DEBUG: org.macports.unload registered provides 'unload', a pre-existing procedure. Target override will not be provided
DEBUG: org.macports.distfiles registered provides 'distfiles', a pre-existing procedure. Target override will not be provided
DEBUG: Using group file /opt/local/var/macports/sources/rsync.macports.org/release/ports/_resources/port1.0/group/muniversal-1.0.tcl
DEBUG: Reading variant descriptions from /opt/local/var/macports/sources/rsync.macports.org/release/ports/_resources/port1.0/variant_descriptions.conf
DEBUG: universal variant already exists, so not adding the default one
DEBUG: Requested variant darwin is not provided by port ncurses.
DEBUG: Requested variant i386 is not provided by port ncurses.
DEBUG: Requested variant macosx is not provided by port ncurses.
DEBUG: Executing variant darwin_10 provides darwin_10
DEBUG: epoch: in tree: 0 installed: 0
DEBUG: ncursesw 5.7_0 exists in the ports tree
DEBUG: ncursesw 5.7_0 +darwin_10 is the latest installed
DEBUG: ncursesw 5.7_0 +darwin_10 is active
DEBUG: Merging existing variants darwin_10 into variants
DEBUG: new fully merged portvariants: 
DEBUG: Changing to port directory: /opt/local/var/macports/sources/rsync.macports.org/release/ports/devel/ncursesw
DEBUG: OS darwin/10.2.0 (Mac OS X 10.6) arch i386
DEBUG: setting option os.universal_supported to yes
DEBUG: org.macports.load registered provides 'load', a pre-existing procedure. Target override will not be provided
DEBUG: org.macports.unload registered provides 'unload', a pre-existing procedure. Target override will not be provided
DEBUG: org.macports.distfiles registered provides 'distfiles', a pre-existing procedure. Target override will not be provided
DEBUG: Using group file /opt/local/var/macports/sources/rsync.macports.org/release/ports/_resources/port1.0/group/muniversal-1.0.tcl
DEBUG: Reading variant descriptions from /opt/local/var/macports/sources/rsync.macports.org/release/ports/_resources/port1.0/variant_descriptions.conf
DEBUG: universal variant already exists, so not adding the default one
DEBUG: Requested variant darwin is not provided by port ncursesw.
DEBUG: Requested variant i386 is not provided by port ncursesw.
DEBUG: Requested variant macosx is not provided by port ncursesw.
DEBUG: Executing variant darwin_10 provides darwin_10
DEBUG: No need to upgrade! ncursesw 5.7_0 >= ncursesw 5.7_0
DEBUG: No need to upgrade! ncurses 5.7_0 >= ncurses 5.7_0
DEBUG: epoch: in tree: 0 installed: 0
DEBUG: expat 2.0.1_0 exists in the ports tree
DEBUG: expat 2.0.1_0  is the latest installed
DEBUG: expat 2.0.1_0  is active
DEBUG: Merging existing variants  into variants
DEBUG: new fully merged portvariants: 
DEBUG: Changing to port directory: /opt/local/var/macports/sources/rsync.macports.org/release/ports/textproc/expat
DEBUG: OS darwin/10.2.0 (Mac OS X 10.6) arch i386
DEBUG: setting option os.universal_supported to yes
DEBUG: org.macports.load registered provides 'load', a pre-existing procedure. Target override will not be provided
DEBUG: org.macports.unload registered provides 'unload', a pre-existing procedure. Target override will not be provided
DEBUG: org.macports.distfiles registered provides 'distfiles', a pre-existing procedure. Target override will not be provided
DEBUG: adding the default universal variant
DEBUG: Reading variant descriptions from /opt/local/var/macports/sources/rsync.macports.org/release/ports/_resources/port1.0/variant_descriptions.conf
DEBUG: Requested variant darwin is not provided by port expat.
DEBUG: Requested variant i386 is not provided by port expat.
DEBUG: Requested variant macosx is not provided by port expat.
DEBUG: No need to upgrade! expat 2.0.1_0 >= expat 2.0.1_0
DEBUG: No need to upgrade! gettext 0.17_4 >= gettext 0.17_4
DEBUG: epoch: in tree: 0 installed: 0
DEBUG: bison 2.4.1_0 exists in the ports tree
DEBUG: bison 2.4.1_0  is the latest installed
DEBUG: bison 2.4.1_0  is active
DEBUG: Merging existing variants  into variants
DEBUG: new fully merged portvariants: 
DEBUG: Changing to port directory: /opt/local/var/macports/sources/rsync.macports.org/release/ports/devel/bison
DEBUG: OS darwin/10.2.0 (Mac OS X 10.6) arch i386
DEBUG: setting option os.universal_supported to yes
DEBUG: org.macports.load registered provides 'load', a pre-existing procedure. Target override will not be provided
DEBUG: org.macports.unload registered provides 'unload', a pre-existing procedure. Target override will not be provided
DEBUG: org.macports.distfiles registered provides 'distfiles', a pre-existing procedure. Target override will not be provided
DEBUG: adding the default universal variant
DEBUG: Reading variant descriptions from /opt/local/var/macports/sources/rsync.macports.org/release/ports/_resources/port1.0/variant_descriptions.conf
DEBUG: Requested variant darwin is not provided by port bison.
DEBUG: Requested variant i386 is not provided by port bison.
DEBUG: Requested variant macosx is not provided by port bison.
DEBUG: epoch: in tree: 0 installed: 0
DEBUG: m4 1.4.13_0 exists in the ports tree
DEBUG: m4 1.4.13_0  is the latest installed
DEBUG: m4 1.4.13_0  is active
DEBUG: Merging existing variants  into variants
DEBUG: new fully merged portvariants: 
DEBUG: Changing to port directory: /opt/local/var/macports/sources/rsync.macports.org/release/ports/devel/m4
DEBUG: OS darwin/10.2.0 (Mac OS X 10.6) arch i386
DEBUG: setting option os.universal_supported to yes
DEBUG: org.macports.load registered provides 'load', a pre-existing procedure. Target override will not be provided
DEBUG: org.macports.unload registered provides 'unload', a pre-existing procedure. Target override will not be provided
DEBUG: org.macports.distfiles registered provides 'distfiles', a pre-existing procedure. Target override will not be provided
DEBUG: adding the default universal variant
DEBUG: Reading variant descriptions from /opt/local/var/macports/sources/rsync.macports.org/release/ports/_resources/port1.0/variant_descriptions.conf
DEBUG: Requested variant darwin is not provided by port m4.
DEBUG: Requested variant i386 is not provided by port m4.
DEBUG: Requested variant macosx is not provided by port m4.
DEBUG: No need to upgrade! m4 1.4.13_0 >= m4 1.4.13_0
DEBUG: No need to upgrade! bison 2.4.1_0 >= bison 2.4.1_0
--->  Computing dependencies for aide
DEBUG: Searching for dependency: mhash
DEBUG: Found Dependency: receipt exists for mhash
DEBUG: Searching for dependency: gettext
DEBUG: Found Dependency: receipt exists for gettext
DEBUG: Searching for dependency: bison
DEBUG: Found Dependency: receipt exists for bison
DEBUG: Executing org.macports.main (aide)
DEBUG: Skipping completed org.macports.fetch (aide)
DEBUG: Skipping completed org.macports.checksum (aide)
DEBUG: Skipping completed org.macports.extract (aide)
DEBUG: Skipping completed org.macports.patch (aide)
DEBUG: Skipping completed org.macports.configure (aide)
--->  Building aide
DEBUG: build phase started at Tue Jan 26 16:13:25 PST 2010
DEBUG: Executing org.macports.build (aide)
DEBUG: Environment: CPATH='/opt/local/include' CC_PRINT_OPTIONS_FILE='/opt/local/var/macports/build/_opt_local_var_macports_sources_rsync.macports.org_release_ports_security_aide/work/.CC_PRINT_OPTIONS' LIBRARY_PATH='/opt/local/lib' CC_PRINT_OPTIONS='YES' MACOSX_DEPLOYMENT_TARGET='10.6'
DEBUG: Assembled command: 'cd "/opt/local/var/macports/build/_opt_local_var_macports_sources_rsync.macports.org_release_ports_security_aide/work/aide-0.13.1" && /usr/bin/make -j2 all'
/usr/bin/make  all-recursive
Making all in src
if /usr/bin/gcc-4.2 -DLOCALEDIR=\"/opt/local/share/locale\" -DHAVE_CONFIG_H -I. -I. -I.. -I../include  -I/opt/local/include  -pipe -O2 -arch x86_64   -pipe -O2 -arch x86_64  -MT conf_yacc.o -MD -MP -MF ".deps/conf_yacc.Tpo" \
	  -c -o conf_yacc.o `test -f 'conf_yacc.c' || echo './'`conf_yacc.c; \
	then mv -f ".deps/conf_yacc.Tpo" ".deps/conf_yacc.Po"; \
	else rm -f ".deps/conf_yacc.Tpo"; exit 1; \
	fi
if /usr/bin/gcc-4.2 -DLOCALEDIR=\"/opt/local/share/locale\" -DHAVE_CONFIG_H -I. -I. -I.. -I../include  -I/opt/local/include  -pipe -O2 -arch x86_64   -pipe -O2 -arch x86_64  -MT conf_lex2.o -MD -MP -MF ".deps/conf_lex2.Tpo" \
	  -c -o conf_lex2.o `test -f 'conf_lex2.c' || echo './'`conf_lex2.c; \
	then mv -f ".deps/conf_lex2.Tpo" ".deps/conf_lex2.Po"; \
	else rm -f ".deps/conf_lex2.Tpo"; exit 1; \
	fi
In file included from /opt/local/include/mutils/mincludes.h:34,
                 from /opt/local/include/mhash.h:6,
                 from ../include/db_config.h:86,
                 from ../include/report.h:26,
                 from ../include/aide.h:24,
                 from ../src/conf_yacc.y:21:
/opt/local/include/mutils/mhash_config.h:186:1: warning: "PACKAGE" redefined
In file included from ../include/aide.h:23,
                 from ../src/conf_yacc.y:21:
../config.h:275:1: warning: this is the location of the previous definition
In file included from /opt/local/include/mutils/mincludes.h:34,
                 from /opt/local/include/mhash.h:6,
                 from ../include/db_config.h:86,
                 from ../include/report.h:26,
                 from ../include/aide.h:24,
                 from ../src/conf_yacc.y:21:
/opt/local/include/mutils/mhash_config.h:189:1: warning: "PACKAGE_BUGREPORT" redefined
In file included from ../include/aide.h:23,
                 from ../src/conf_yacc.y:21:
../config.h:278:1: warning: this is the location of the previous definition
In file included from /opt/local/include/mutils/mincludes.h:34,
                 from /opt/local/include/mhash.h:6,
                 from ../include/db_config.h:86,
                 from ../include/report.h:26,
                 from ../include/aide.h:24,
                 from ../src/conf_yacc.y:21:
/opt/local/include/mutils/mhash_config.h:192:1: warning: "PACKAGE_NAME" redefined
In file included from ../include/aide.h:23,
                 from ../src/conf_yacc.y:21:
../config.h:281:1: warning: this is the location of the previous definition
In file included from /opt/local/include/mutils/mincludes.h:34,
                 from /opt/local/include/mhash.h:6,
                 from ../include/db_config.h:86,
                 from ../include/report.h:26,
                 from ../include/aide.h:24,
                 from ../src/conf_yacc.y:21:
/opt/local/include/mutils/mhash_config.h:195:1: warning: "PACKAGE_STRING" redefined
In file included from ../include/aide.h:23,
                 from ../src/conf_yacc.y:21:
../config.h:284:1: warning: this is the location of the previous definition
In file included from /opt/local/include/mutils/mincludes.h:34,
                 from /opt/local/include/mhash.h:6,
                 from ../include/db_config.h:86,
                 from ../include/report.h:26,
                 from ../include/aide.h:24,
                 from ../src/conf_yacc.y:21:
/opt/local/include/mutils/mhash_config.h:198:1: warning: "PACKAGE_TARNAME" redefined
In file included from ../include/aide.h:23,
                 from ../src/conf_yacc.y:21:
../config.h:287:1: warning: this is the location of the previous definition
In file included from /opt/local/include/mutils/mincludes.h:34,
                 from /opt/local/include/mhash.h:6,
                 from ../include/db_config.h:86,
                 from ../include/report.h:26,
                 from ../include/aide.h:24,
                 from ../src/conf_yacc.y:21:
/opt/local/include/mutils/mhash_config.h:201:1: warning: "PACKAGE_VERSION" redefined
In file included from ../include/aide.h:23,
                 from ../src/conf_yacc.y:21:
../config.h:290:1: warning: this is the location of the previous definition
In file included from /opt/local/include/mutils/mincludes.h:34,
                 from /opt/local/include/mhash.h:6,
                 from ../include/db_config.h:86,
                 from ../include/report.h:26,
                 from ../include/aide.h:24,
                 from ../src/conf_yacc.y:21:
/opt/local/include/mutils/mhash_config.h:213:1: warning: "VERSION" redefined
In file included from ../include/aide.h:23,
                 from ../src/conf_yacc.y:21:
../config.h:317:1: warning: this is the location of the previous definition
In file included from /opt/local/include/mutils/mincludes.h:34,
                 from /opt/local/include/mhash.h:6,
                 from ../include/db_config.h:86,
                 from ../include/report.h:26,
                 from ../include/aide.h:24,
                 from conf_lex2.c:6:
/opt/local/include/mutils/mhash_config.h:186:1: warning: "PACKAGE" redefined
In file included from ../include/aide.h:23,
                 from conf_lex2.c:6:
../config.h:275:1: warning: this is the location of the previous definition
In file included from /opt/local/include/mutils/mincludes.h:34,
                 from /opt/local/include/mhash.h:6,
                 from ../include/db_config.h:86,
                 from ../include/report.h:26,
                 from ../include/aide.h:24,
                 from conf_lex2.c:6:
/opt/local/include/mutils/mhash_config.h:189:1: warning: "PACKAGE_BUGREPORT" redefined
In file included from ../include/aide.h:23,
                 from conf_lex2.c:6:
../config.h:278:1: warning: this is the location of the previous definition
In file included from /opt/local/include/mutils/mincludes.h:34,
                 from /opt/local/include/mhash.h:6,
                 from ../include/db_config.h:86,
                 from ../include/report.h:26,
                 from ../include/aide.h:24,
                 from conf_lex2.c:6:
/opt/local/include/mutils/mhash_config.h:192:1: warning: "PACKAGE_NAME" redefined
In file included from ../include/aide.h:23,
                 from conf_lex2.c:6:
../config.h:281:1: warning: this is the location of the previous definition
In file included from /opt/local/include/mutils/mincludes.h:34,
                 from /opt/local/include/mhash.h:6,
                 from ../include/db_config.h:86,
                 from ../include/report.h:26,
                 from ../include/aide.h:24,
                 from conf_lex2.c:6:
/opt/local/include/mutils/mhash_config.h:195:1: warning: "PACKAGE_STRING" redefined
In file included from ../include/aide.h:23,
                 from conf_lex2.c:6:
../config.h:284:1: warning: this is the location of the previous definition
In file included from /opt/local/include/mutils/mincludes.h:34,
                 from /opt/local/include/mhash.h:6,
                 from ../include/db_config.h:86,
                 from ../include/report.h:26,
                 from ../include/aide.h:24,
                 from conf_lex2.c:6:
/opt/local/include/mutils/mhash_config.h:198:1: warning: "PACKAGE_TARNAME" redefined
In file included from ../include/aide.h:23,
                 from conf_lex2.c:6:
../config.h:287:1: warning: this is the location of the previous definition
In file included from /opt/local/include/mutils/mincludes.h:34,
                 from /opt/local/include/mhash.h:6,
                 from ../include/db_config.h:86,
                 from ../include/report.h:26,
                 from ../include/aide.h:24,
                 from conf_lex2.c:6:
/opt/local/include/mutils/mhash_config.h:201:1: warning: "PACKAGE_VERSION" redefined
In file included from ../include/aide.h:23,
                 from conf_lex2.c:6:
../config.h:290:1: warning: this is the location of the previous definition
In file included from /opt/local/include/mutils/mincludes.h:34,
                 from /opt/local/include/mhash.h:6,
                 from ../include/db_config.h:86,
                 from ../include/report.h:26,
                 from ../include/aide.h:24,
                 from conf_lex2.c:6:
/opt/local/include/mutils/mhash_config.h:213:1: warning: "VERSION" redefined
In file included from ../include/aide.h:23,
                 from conf_lex2.c:6:
../config.h:317:1: warning: this is the location of the previous definition
In file included from ../include/report.h:26,
                 from ../include/aide.h:24,
                 from ../src/conf_yacc.y:21:
../include/db_config.h:371: error: expected specifier-qualifier-list before 'off64_t'
make[2]: *** [conf_yacc.o] Error 1
make[2]: *** Waiting for unfinished jobs....
In file included from ../include/report.h:26,
                 from ../include/aide.h:24,
                 from conf_lex2.c:6:
../include/db_config.h:371: error: expected specifier-qualifier-list before 'off64_t'
make[2]: *** [conf_lex2.o] Error 1
make[1]: *** [all-recursive] Error 1
make: *** [all] Error 2
Error: Target org.macports.build returned: shell command " cd "/opt/local/var/macports/build/_opt_local_var_macports_sources_rsync.macports.org_release_ports_security_aide/work/aide-0.13.1" && /usr/bin/make -j2 all " returned error 2
Command output:                  from ../include/report.h:26,
                 from ../include/aide.h:24,
                 from conf_lex2.c:6:
/opt/local/include/mutils/mhash_config.h:201:1: warning: "PACKAGE_VERSION" redefined
In file included from ../include/aide.h:23,
                 from conf_lex2.c:6:
../config.h:290:1: warning: this is the location of the previous definition
In file included from /opt/local/include/mutils/mincludes.h:34,
                 from /opt/local/include/mhash.h:6,
                 from ../include/db_config.h:86,
                 from ../include/report.h:26,
                 from ../include/aide.h:24,
                 from conf_lex2.c:6:
/opt/local/include/mutils/mhash_config.h:213:1: warning: "VERSION" redefined
In file included from ../include/aide.h:23,
                 from conf_lex2.c:6:
../config.h:317:1: warning: this is the location of the previous definition
In file included from ../include/report.h:26,
                 from ../include/aide.h:24,
                 from ../src/conf_yacc.y:21:
../include/db_config.h:371: error: expected specifier-qualifier-list before 'off64_t'
make[2]: *** [conf_yacc.o] Error 1
make[2]: *** Waiting for unfinished jobs....
In file included from ../include/report.h:26,
                 from ../include/aide.h:24,
                 from conf_lex2.c:6:
../include/db_config.h:371: error: expected specifier-qualifier-list before 'off64_t'
make[2]: *** [conf_lex2.o] Error 1
make[1]: *** [all-recursive] Error 1
make: *** [all] Error 2

DEBUG: Backtrace: shell command " cd "/opt/local/var/macports/build/_opt_local_var_macports_sources_rsync.macports.org_release_ports_security_aide/work/aide-0.13.1" && /usr/bin/make -j2 all " returned error 2
Command output:                  from ../include/report.h:26,
                 from ../include/aide.h:24,
                 from conf_lex2.c:6:
/opt/local/include/mutils/mhash_config.h:201:1: warning: "PACKAGE_VERSION" redefined
In file included from ../include/aide.h:23,
                 from conf_lex2.c:6:
../config.h:290:1: warning: this is the location of the previous definition
In file included from /opt/local/include/mutils/mincludes.h:34,
                 from /opt/local/include/mhash.h:6,
                 from ../include/db_config.h:86,
                 from ../include/report.h:26,
                 from ../include/aide.h:24,
                 from conf_lex2.c:6:
/opt/local/include/mutils/mhash_config.h:213:1: warning: "VERSION" redefined
In file included from ../include/aide.h:23,
                 from conf_lex2.c:6:
../config.h:317:1: warning: this is the location of the previous definition
In file included from ../include/report.h:26,
                 from ../include/aide.h:24,
                 from ../src/conf_yacc.y:21:
../include/db_config.h:371: error: expected specifier-qualifier-list before 'off64_t'
make[2]: *** [conf_yacc.o] Error 1
make[2]: *** Waiting for unfinished jobs....
In file included from ../include/report.h:26,
                 from ../include/aide.h:24,
                 from conf_lex2.c:6:
../include/db_config.h:371: error: expected specifier-qualifier-list before 'off64_t'
make[2]: *** [conf_lex2.o] Error 1
make[1]: *** [all-recursive] Error 1
make: *** [all] Error 2

    while executing
"command_exec build"
    (procedure "portbuild::build_main" line 9)
    invoked from within
"$procedure $targetname"
Warning: the following items did not execute (for aide): org.macports.activate org.macports.build org.macports.destroot org.macports.install
Error: Status 1 encountered during processing.
unixnet-dhcp-29:~ earnan$ 

Change History (2)

comment:1 Changed 10 years ago by mf2k (Frank Schima)

Description: modified (diff)
Priority: HighNormal

comment:2 Changed 9 years ago by jmroot (Joshua Root)

Resolution: fixed
Status: newclosed
Note: See TracTickets for help on using tickets.