Opened 11 years ago

Closed 10 years ago

#24630 closed defect (duplicate)

postgresql-devel broken

Reported by: wharton.n@… Owned by: chepra@…
Priority: Normal Milestone:
Component: ports Version: 1.8.2
Keywords: Cc:
Port: postgresql-devel

Description (last modified by jmroot (Joshua Root))

on a new (4/23/2010) macbook pro with snow leopard I installed installing postgresql84-server successfully, I get this: (I need the devel packages to compile psycopg2)

> sudo port -d install postgresql-devel

DEBUG: Found port in file:///opt/local/var/macports/sources/rsync.macports.org/release/ports/databases/postgresql-devel
DEBUG: Changing to port directory: /opt/local/var/macports/sources/rsync.macports.org/release/ports/databases/postgresql-devel
DEBUG: OS Platform: darwin
DEBUG: OS Version: 10.3.1
DEBUG: Mac OS X Version: 10.6
DEBUG: System Arch: i386
DEBUG: setting option os.universal_supported to yes
DEBUG: org.macports.load registered provides 'load', a pre-existing procedure. Target override will not be provided
DEBUG: org.macports.unload registered provides 'unload', a pre-existing procedure. Target override will not be provided
DEBUG: org.macports.distfiles registered provides 'distfiles', a pre-existing procedure. Target override will not be provided
DEBUG: adding the default universal variant
DEBUG: Reading variant descriptions from /opt/local/var/macports/sources/rsync.macports.org/release/ports/_resources/port1.0/variant_descriptions.conf
DEBUG: Requested variant darwin is not provided by port postgresql-devel.
DEBUG: Requested variant i386 is not provided by port postgresql-devel.
DEBUG: Requested variant macosx is not provided by port postgresql-devel.
DEBUG: Found port in file:///opt/local/var/macports/sources/rsync.macports.org/release/ports/devel/readline
DEBUG: epoch: in tree: 0 installed: 0
DEBUG: readline 6.1.000_1 exists in the ports tree
DEBUG: readline 6.1.000_1 +darwin is the latest installed
DEBUG: readline 6.1.000_1 +darwin is active
DEBUG: Merging existing variants darwin into variants
DEBUG: new fully merged portvariants: 
DEBUG: Changing to port directory: /opt/local/var/macports/sources/rsync.macports.org/release/ports/devel/readline
DEBUG: OS Platform: darwin
DEBUG: OS Version: 10.3.1
DEBUG: Mac OS X Version: 10.6
DEBUG: System Arch: i386
DEBUG: setting option os.universal_supported to yes
DEBUG: org.macports.load registered provides 'load', a pre-existing procedure. Target override will not be provided
DEBUG: org.macports.unload registered provides 'unload', a pre-existing procedure. Target override will not be provided
DEBUG: org.macports.distfiles registered provides 'distfiles', a pre-existing procedure. Target override will not be provided
DEBUG: Using group file /opt/local/var/macports/sources/rsync.macports.org/release/ports/_resources/port1.0/group/muniversal-1.0.tcl
DEBUG: Reading variant descriptions from /opt/local/var/macports/sources/rsync.macports.org/release/ports/_resources/port1.0/variant_descriptions.conf
DEBUG: universal variant already exists, so not adding the default one
DEBUG: Requested variant i386 is not provided by port readline.
DEBUG: Requested variant macosx is not provided by port readline.
DEBUG: Executing variant darwin provides darwin
DEBUG: Found port in file:///opt/local/var/macports/sources/rsync.macports.org/release/ports/devel/ncurses
DEBUG: epoch: in tree: 0 installed: 0
DEBUG: ncurses 5.7_0 exists in the ports tree
DEBUG: ncurses 5.7_0 +darwin_10 is the latest installed
DEBUG: ncurses 5.7_0 +darwin_10 is active
DEBUG: Merging existing variants darwin_10 into variants
DEBUG: new fully merged portvariants: 
DEBUG: Changing to port directory: /opt/local/var/macports/sources/rsync.macports.org/release/ports/devel/ncurses
DEBUG: OS Platform: darwin
DEBUG: OS Version: 10.3.1
DEBUG: Mac OS X Version: 10.6
DEBUG: System Arch: i386
DEBUG: setting option os.universal_supported to yes
DEBUG: org.macports.load registered provides 'load', a pre-existing procedure. Target override will not be provided
DEBUG: org.macports.unload registered provides 'unload', a pre-existing procedure. Target override will not be provided
DEBUG: org.macports.distfiles registered provides 'distfiles', a pre-existing procedure. Target override will not be provided
DEBUG: Using group file /opt/local/var/macports/sources/rsync.macports.org/release/ports/_resources/port1.0/group/muniversal-1.0.tcl
DEBUG: Reading variant descriptions from /opt/local/var/macports/sources/rsync.macports.org/release/ports/_resources/port1.0/variant_descriptions.conf
DEBUG: universal variant already exists, so not adding the default one
DEBUG: Requested variant darwin is not provided by port ncurses.
DEBUG: Requested variant i386 is not provided by port ncurses.
DEBUG: Requested variant macosx is not provided by port ncurses.
DEBUG: Executing variant darwin_10 provides darwin_10
DEBUG: Found port in file:///opt/local/var/macports/sources/rsync.macports.org/release/ports/devel/ncursesw
DEBUG: epoch: in tree: 0 installed: 0
DEBUG: ncursesw 5.7_0 exists in the ports tree
DEBUG: ncursesw 5.7_0 +darwin_10 is the latest installed
DEBUG: ncursesw 5.7_0 +darwin_10 is active
DEBUG: Merging existing variants darwin_10 into variants
DEBUG: new fully merged portvariants: 
DEBUG: Changing to port directory: /opt/local/var/macports/sources/rsync.macports.org/release/ports/devel/ncursesw
DEBUG: OS Platform: darwin
DEBUG: OS Version: 10.3.1
DEBUG: Mac OS X Version: 10.6
DEBUG: System Arch: i386
DEBUG: setting option os.universal_supported to yes
DEBUG: org.macports.load registered provides 'load', a pre-existing procedure. Target override will not be provided
DEBUG: org.macports.unload registered provides 'unload', a pre-existing procedure. Target override will not be provided
DEBUG: org.macports.distfiles registered provides 'distfiles', a pre-existing procedure. Target override will not be provided
DEBUG: Using group file /opt/local/var/macports/sources/rsync.macports.org/release/ports/_resources/port1.0/group/muniversal-1.0.tcl
DEBUG: Reading variant descriptions from /opt/local/var/macports/sources/rsync.macports.org/release/ports/_resources/port1.0/variant_descriptions.conf
DEBUG: universal variant already exists, so not adding the default one
DEBUG: Requested variant darwin is not provided by port ncursesw.
DEBUG: Requested variant i386 is not provided by port ncursesw.
DEBUG: Requested variant macosx is not provided by port ncursesw.
DEBUG: Executing variant darwin_10 provides darwin_10
DEBUG: No need to upgrade! ncursesw 5.7_0 >= ncursesw 5.7_0
DEBUG: No need to upgrade! ncurses 5.7_0 >= ncurses 5.7_0
DEBUG: No need to upgrade! readline 6.1.000_1 >= readline 6.1.000_1
DEBUG: Found port in file:///opt/local/var/macports/sources/rsync.macports.org/release/ports/devel/openssl
DEBUG: epoch: in tree: 1 installed: 1
DEBUG: openssl 0.9.8n_0 exists in the ports tree
DEBUG: openssl 0.9.8n_0 +darwin is the latest installed
DEBUG: openssl 0.9.8n_0 +darwin is active
DEBUG: Merging existing variants darwin into variants
DEBUG: new fully merged portvariants: 
DEBUG: Changing to port directory: /opt/local/var/macports/sources/rsync.macports.org/release/ports/devel/openssl
DEBUG: OS Platform: darwin
DEBUG: OS Version: 10.3.1
DEBUG: Mac OS X Version: 10.6
DEBUG: System Arch: i386
DEBUG: setting option os.universal_supported to yes
DEBUG: org.macports.load registered provides 'load', a pre-existing procedure. Target override will not be provided
DEBUG: org.macports.unload registered provides 'unload', a pre-existing procedure. Target override will not be provided
DEBUG: org.macports.distfiles registered provides 'distfiles', a pre-existing procedure. Target override will not be provided
DEBUG: Using group file /opt/local/var/macports/sources/rsync.macports.org/release/ports/_resources/port1.0/group/muniversal-1.0.tcl
DEBUG: Reading variant descriptions from /opt/local/var/macports/sources/rsync.macports.org/release/ports/_resources/port1.0/variant_descriptions.conf
DEBUG: universal variant already exists, so not adding the default one
DEBUG: Requested variant i386 is not provided by port openssl.
DEBUG: Requested variant macosx is not provided by port openssl.
DEBUG: Executing variant darwin provides darwin
DEBUG: Found port in file:///opt/local/var/macports/sources/rsync.macports.org/release/ports/archivers/zlib
DEBUG: epoch: in tree: 0 installed: 0
DEBUG: zlib 1.2.5_0 exists in the ports tree
DEBUG: zlib 1.2.5_0  is the latest installed
DEBUG: zlib 1.2.5_0  is active
DEBUG: Merging existing variants  into variants
DEBUG: new fully merged portvariants: 
DEBUG: Changing to port directory: /opt/local/var/macports/sources/rsync.macports.org/release/ports/archivers/zlib
DEBUG: OS Platform: darwin
DEBUG: OS Version: 10.3.1
DEBUG: Mac OS X Version: 10.6
DEBUG: System Arch: i386
DEBUG: setting option os.universal_supported to yes
DEBUG: org.macports.load registered provides 'load', a pre-existing procedure. Target override will not be provided
DEBUG: org.macports.unload registered provides 'unload', a pre-existing procedure. Target override will not be provided
DEBUG: org.macports.distfiles registered provides 'distfiles', a pre-existing procedure. Target override will not be provided
DEBUG: adding the default universal variant
DEBUG: Reading variant descriptions from /opt/local/var/macports/sources/rsync.macports.org/release/ports/_resources/port1.0/variant_descriptions.conf
DEBUG: Requested variant darwin is not provided by port zlib.
DEBUG: Requested variant i386 is not provided by port zlib.
DEBUG: Requested variant macosx is not provided by port zlib.
DEBUG: No need to upgrade! zlib 1.2.5_0 >= zlib 1.2.5_0
DEBUG: No need to upgrade! openssl 0.9.8n_0 >= openssl 0.9.8n_0
DEBUG: Found port in file:///opt/local/var/macports/sources/rsync.macports.org/release/ports/textproc/libxml2
DEBUG: epoch: in tree: 0 installed: 0
DEBUG: libxml2 2.7.7_0 exists in the ports tree
DEBUG: libxml2 2.7.7_0  is the latest installed
DEBUG: libxml2 2.7.7_0  is active
DEBUG: Merging existing variants  into variants
DEBUG: new fully merged portvariants: 
DEBUG: Changing to port directory: /opt/local/var/macports/sources/rsync.macports.org/release/ports/textproc/libxml2
DEBUG: OS Platform: darwin
DEBUG: OS Version: 10.3.1
DEBUG: Mac OS X Version: 10.6
DEBUG: System Arch: i386
DEBUG: setting option os.universal_supported to yes
DEBUG: org.macports.load registered provides 'load', a pre-existing procedure. Target override will not be provided
DEBUG: org.macports.unload registered provides 'unload', a pre-existing procedure. Target override will not be provided
DEBUG: org.macports.distfiles registered provides 'distfiles', a pre-existing procedure. Target override will not be provided
DEBUG: Using group file /opt/local/var/macports/sources/rsync.macports.org/release/ports/_resources/port1.0/group/archcheck-1.0.tcl
DEBUG: adding the default universal variant
DEBUG: Reading variant descriptions from /opt/local/var/macports/sources/rsync.macports.org/release/ports/_resources/port1.0/variant_descriptions.conf
DEBUG: Requested variant darwin is not provided by port libxml2.
DEBUG: Requested variant i386 is not provided by port libxml2.
DEBUG: Requested variant macosx is not provided by port libxml2.
DEBUG: Found port in file:///opt/local/var/macports/sources/rsync.macports.org/release/ports/textproc/libiconv
DEBUG: epoch: in tree: 0 installed: 0
DEBUG: libiconv 1.13.1_0 exists in the ports tree
DEBUG: libiconv 1.13.1_0  is the latest installed
DEBUG: libiconv 1.13.1_0  is active
DEBUG: Merging existing variants  into variants
DEBUG: new fully merged portvariants: 
DEBUG: Changing to port directory: /opt/local/var/macports/sources/rsync.macports.org/release/ports/textproc/libiconv
DEBUG: OS Platform: darwin
DEBUG: OS Version: 10.3.1
DEBUG: Mac OS X Version: 10.6
DEBUG: System Arch: i386
DEBUG: setting option os.universal_supported to yes
DEBUG: org.macports.load registered provides 'load', a pre-existing procedure. Target override will not be provided
DEBUG: org.macports.unload registered provides 'unload', a pre-existing procedure. Target override will not be provided
DEBUG: org.macports.distfiles registered provides 'distfiles', a pre-existing procedure. Target override will not be provided
DEBUG: Using group file /opt/local/var/macports/sources/rsync.macports.org/release/ports/_resources/port1.0/group/muniversal-1.0.tcl
DEBUG: Reading variant descriptions from /opt/local/var/macports/sources/rsync.macports.org/release/ports/_resources/port1.0/variant_descriptions.conf
DEBUG: universal variant already exists, so not adding the default one
DEBUG: Requested variant darwin is not provided by port libiconv.
DEBUG: Requested variant i386 is not provided by port libiconv.
DEBUG: Requested variant macosx is not provided by port libiconv.
DEBUG: Found port in file:///opt/local/var/macports/sources/rsync.macports.org/release/ports/devel/gperf
DEBUG: epoch: in tree: 0 installed: 0
DEBUG: gperf 3.0.4_0 exists in the ports tree
DEBUG: gperf 3.0.4_0  is the latest installed
DEBUG: gperf 3.0.4_0  is active
DEBUG: Merging existing variants  into variants
DEBUG: new fully merged portvariants: 
DEBUG: Changing to port directory: /opt/local/var/macports/sources/rsync.macports.org/release/ports/devel/gperf
DEBUG: OS Platform: darwin
DEBUG: OS Version: 10.3.1
DEBUG: Mac OS X Version: 10.6
DEBUG: System Arch: i386
DEBUG: setting option os.universal_supported to yes
DEBUG: org.macports.load registered provides 'load', a pre-existing procedure. Target override will not be provided
DEBUG: org.macports.unload registered provides 'unload', a pre-existing procedure. Target override will not be provided
DEBUG: org.macports.distfiles registered provides 'distfiles', a pre-existing procedure. Target override will not be provided
DEBUG: Using group file /opt/local/var/macports/sources/rsync.macports.org/release/ports/_resources/port1.0/group/muniversal-1.0.tcl
DEBUG: Reading variant descriptions from /opt/local/var/macports/sources/rsync.macports.org/release/ports/_resources/port1.0/variant_descriptions.conf
DEBUG: universal variant already exists, so not adding the default one
DEBUG: Requested variant darwin is not provided by port gperf.
DEBUG: Requested variant i386 is not provided by port gperf.
DEBUG: Requested variant macosx is not provided by port gperf.
DEBUG: No need to upgrade! gperf 3.0.4_0 >= gperf 3.0.4_0
DEBUG: No need to upgrade! libiconv 1.13.1_0 >= libiconv 1.13.1_0
DEBUG: No need to upgrade! libxml2 2.7.7_0 >= libxml2 2.7.7_0
DEBUG: Found port in file:///opt/local/var/macports/sources/rsync.macports.org/release/ports/textproc/libxslt
DEBUG: epoch: in tree: 0 installed: 0
DEBUG: libxslt 1.1.26_0 exists in the ports tree
DEBUG: libxslt 1.1.26_0  is the latest installed
DEBUG: libxslt 1.1.26_0  is active
DEBUG: Merging existing variants  into variants
DEBUG: new fully merged portvariants: 
DEBUG: Changing to port directory: /opt/local/var/macports/sources/rsync.macports.org/release/ports/textproc/libxslt
DEBUG: OS Platform: darwin
DEBUG: OS Version: 10.3.1
DEBUG: Mac OS X Version: 10.6
DEBUG: System Arch: i386
DEBUG: setting option os.universal_supported to yes
DEBUG: org.macports.load registered provides 'load', a pre-existing procedure. Target override will not be provided
DEBUG: org.macports.unload registered provides 'unload', a pre-existing procedure. Target override will not be provided
DEBUG: org.macports.distfiles registered provides 'distfiles', a pre-existing procedure. Target override will not be provided
DEBUG: Using group file /opt/local/var/macports/sources/rsync.macports.org/release/ports/_resources/port1.0/group/muniversal-1.0.tcl
DEBUG: Reading variant descriptions from /opt/local/var/macports/sources/rsync.macports.org/release/ports/_resources/port1.0/variant_descriptions.conf
DEBUG: universal variant already exists, so not adding the default one
DEBUG: Requested variant darwin is not provided by port libxslt.
DEBUG: Requested variant i386 is not provided by port libxslt.
DEBUG: Requested variant macosx is not provided by port libxslt.
DEBUG: No need to upgrade! libxslt 1.1.26_0 >= libxslt 1.1.26_0
DEBUG: Found port in file:///opt/local/var/macports/sources/rsync.macports.org/release/ports/devel/ossp-uuid
DEBUG: epoch: in tree: 0 installed: 0
DEBUG: ossp-uuid 1.6.2_0 exists in the ports tree
DEBUG: ossp-uuid 1.6.2_0  is the latest installed
DEBUG: ossp-uuid 1.6.2_0  is active
DEBUG: Merging existing variants  into variants
DEBUG: new fully merged portvariants: 
DEBUG: Changing to port directory: /opt/local/var/macports/sources/rsync.macports.org/release/ports/devel/ossp-uuid
DEBUG: OS Platform: darwin
DEBUG: OS Version: 10.3.1
DEBUG: Mac OS X Version: 10.6
DEBUG: System Arch: i386
DEBUG: setting option os.universal_supported to yes
DEBUG: org.macports.load registered provides 'load', a pre-existing procedure. Target override will not be provided
DEBUG: org.macports.unload registered provides 'unload', a pre-existing procedure. Target override will not be provided
DEBUG: org.macports.distfiles registered provides 'distfiles', a pre-existing procedure. Target override will not be provided
DEBUG: Using group file /opt/local/var/macports/sources/rsync.macports.org/release/ports/_resources/port1.0/group/muniversal-1.0.tcl
DEBUG: Reading variant descriptions from /opt/local/var/macports/sources/rsync.macports.org/release/ports/_resources/port1.0/variant_descriptions.conf
DEBUG: universal variant already exists, so not adding the default one
DEBUG: Requested variant darwin is not provided by port ossp-uuid.
DEBUG: Requested variant i386 is not provided by port ossp-uuid.
DEBUG: Requested variant macosx is not provided by port ossp-uuid.
DEBUG: No need to upgrade! ossp-uuid 1.6.2_0 >= ossp-uuid 1.6.2_0
DEBUG: Found port in file:///opt/local/var/macports/sources/rsync.macports.org/release/ports/devel/bison
DEBUG: epoch: in tree: 0 installed: 0
DEBUG: bison 2.4.2_0 exists in the ports tree
DEBUG: bison 2.4.2_0  is the latest installed
DEBUG: bison 2.4.2_0  is active
DEBUG: Merging existing variants  into variants
DEBUG: new fully merged portvariants: 
DEBUG: Changing to port directory: /opt/local/var/macports/sources/rsync.macports.org/release/ports/devel/bison
DEBUG: OS Platform: darwin
DEBUG: OS Version: 10.3.1
DEBUG: Mac OS X Version: 10.6
DEBUG: System Arch: i386
DEBUG: setting option os.universal_supported to yes
DEBUG: org.macports.load registered provides 'load', a pre-existing procedure. Target override will not be provided
DEBUG: org.macports.unload registered provides 'unload', a pre-existing procedure. Target override will not be provided
DEBUG: org.macports.distfiles registered provides 'distfiles', a pre-existing procedure. Target override will not be provided
DEBUG: adding the default universal variant
DEBUG: Reading variant descriptions from /opt/local/var/macports/sources/rsync.macports.org/release/ports/_resources/port1.0/variant_descriptions.conf
DEBUG: Requested variant darwin is not provided by port bison.
DEBUG: Requested variant i386 is not provided by port bison.
DEBUG: Requested variant macosx is not provided by port bison.
DEBUG: Found port in file:///opt/local/var/macports/sources/rsync.macports.org/release/ports/devel/gettext
DEBUG: epoch: in tree: 0 installed: 0
DEBUG: gettext 0.17_4 exists in the ports tree
DEBUG: gettext 0.17_4  is the latest installed
DEBUG: gettext 0.17_4  is active
DEBUG: Merging existing variants  into variants
DEBUG: new fully merged portvariants: 
DEBUG: Changing to port directory: /opt/local/var/macports/sources/rsync.macports.org/release/ports/devel/gettext
DEBUG: OS Platform: darwin
DEBUG: OS Version: 10.3.1
DEBUG: Mac OS X Version: 10.6
DEBUG: System Arch: i386
DEBUG: setting option os.universal_supported to yes
DEBUG: org.macports.load registered provides 'load', a pre-existing procedure. Target override will not be provided
DEBUG: org.macports.unload registered provides 'unload', a pre-existing procedure. Target override will not be provided
DEBUG: org.macports.distfiles registered provides 'distfiles', a pre-existing procedure. Target override will not be provided
DEBUG: Using group file /opt/local/var/macports/sources/rsync.macports.org/release/ports/_resources/port1.0/group/muniversal-1.0.tcl
DEBUG: Reading variant descriptions from /opt/local/var/macports/sources/rsync.macports.org/release/ports/_resources/port1.0/variant_descriptions.conf
DEBUG: Using group file /opt/local/var/macports/sources/rsync.macports.org/release/ports/_resources/port1.0/group/archcheck-1.0.tcl
DEBUG: universal variant already exists, so not adding the default one
DEBUG: Requested variant darwin is not provided by port gettext.
DEBUG: Requested variant i386 is not provided by port gettext.
DEBUG: Requested variant macosx is not provided by port gettext.
DEBUG: Found port in file:///opt/local/var/macports/sources/rsync.macports.org/release/ports/textproc/expat
DEBUG: epoch: in tree: 0 installed: 0
DEBUG: expat 2.0.1_0 exists in the ports tree
DEBUG: expat 2.0.1_0  is the latest installed
DEBUG: expat 2.0.1_0  is active
DEBUG: Merging existing variants  into variants
DEBUG: new fully merged portvariants: 
DEBUG: Changing to port directory: /opt/local/var/macports/sources/rsync.macports.org/release/ports/textproc/expat
DEBUG: OS Platform: darwin
DEBUG: OS Version: 10.3.1
DEBUG: Mac OS X Version: 10.6
DEBUG: System Arch: i386
DEBUG: setting option os.universal_supported to yes
DEBUG: org.macports.load registered provides 'load', a pre-existing procedure. Target override will not be provided
DEBUG: org.macports.unload registered provides 'unload', a pre-existing procedure. Target override will not be provided
DEBUG: org.macports.distfiles registered provides 'distfiles', a pre-existing procedure. Target override will not be provided
DEBUG: adding the default universal variant
DEBUG: Reading variant descriptions from /opt/local/var/macports/sources/rsync.macports.org/release/ports/_resources/port1.0/variant_descriptions.conf
DEBUG: Requested variant darwin is not provided by port expat.
DEBUG: Requested variant i386 is not provided by port expat.
DEBUG: Requested variant macosx is not provided by port expat.
DEBUG: No need to upgrade! expat 2.0.1_0 >= expat 2.0.1_0
DEBUG: No need to upgrade! gettext 0.17_4 >= gettext 0.17_4
DEBUG: Found port in file:///opt/local/var/macports/sources/rsync.macports.org/release/ports/devel/m4
DEBUG: epoch: in tree: 0 installed: 0
DEBUG: m4 1.4.14_0 exists in the ports tree
DEBUG: m4 1.4.14_0  is the latest installed
DEBUG: m4 1.4.14_0  is active
DEBUG: Merging existing variants  into variants
DEBUG: new fully merged portvariants: 
DEBUG: Changing to port directory: /opt/local/var/macports/sources/rsync.macports.org/release/ports/devel/m4
DEBUG: OS Platform: darwin
DEBUG: OS Version: 10.3.1
DEBUG: Mac OS X Version: 10.6
DEBUG: System Arch: i386
DEBUG: setting option os.universal_supported to yes
DEBUG: org.macports.load registered provides 'load', a pre-existing procedure. Target override will not be provided
DEBUG: org.macports.unload registered provides 'unload', a pre-existing procedure. Target override will not be provided
DEBUG: org.macports.distfiles registered provides 'distfiles', a pre-existing procedure. Target override will not be provided
DEBUG: adding the default universal variant
DEBUG: Reading variant descriptions from /opt/local/var/macports/sources/rsync.macports.org/release/ports/_resources/port1.0/variant_descriptions.conf
DEBUG: Requested variant darwin is not provided by port m4.
DEBUG: Requested variant i386 is not provided by port m4.
DEBUG: Requested variant macosx is not provided by port m4.
DEBUG: No need to upgrade! m4 1.4.14_0 >= m4 1.4.14_0
DEBUG: No need to upgrade! bison 2.4.2_0 >= bison 2.4.2_0
--->  Computing dependencies for postgresql-devel
DEBUG: Searching for dependency: cvs
DEBUG: Didn't find receipt, going to depspec regex for: cvs
DEBUG: Found Dependency: path: /usr/bin filename: cvs regex: ^cvs$
DEBUG: Searching for dependency: readline
DEBUG: Found Dependency: receipt exists for readline
DEBUG: Searching for dependency: openssl
DEBUG: Found Dependency: receipt exists for openssl
DEBUG: Searching for dependency: zlib
DEBUG: Found Dependency: receipt exists for zlib
DEBUG: Searching for dependency: libxml2
DEBUG: Found Dependency: receipt exists for libxml2
DEBUG: Searching for dependency: libxslt
DEBUG: Found Dependency: receipt exists for libxslt
DEBUG: Searching for dependency: ossp-uuid
DEBUG: Found Dependency: receipt exists for ossp-uuid
DEBUG: Searching for dependency: bison
DEBUG: Found Dependency: receipt exists for bison
DEBUG: Executing org.macports.main (postgresql-devel)
DEBUG: Skipping completed org.macports.fetch (postgresql-devel)
DEBUG: Skipping completed org.macports.checksum (postgresql-devel)
DEBUG: Skipping completed org.macports.extract (postgresql-devel)
DEBUG: Skipping completed org.macports.patch (postgresql-devel)
DEBUG: Skipping completed org.macports.configure (postgresql-devel)
--->  Building postgresql-devel
DEBUG: Executing org.macports.build (postgresql-devel)
DEBUG: Environment: MACOSX_DEPLOYMENT_TARGET='10.6'
DEBUG: Assembled command: 'cd "/opt/local/var/macports/build/_opt_local_var_macports_sources_rsync.macports.org_release_ports_databases_postgresql-devel/work/pgsql" && /usr/bin/gnumake -j4'
/usr/bin/gnumake -C doc all
gnumake[1]: Nothing to be done for `all'.
/usr/bin/gnumake -C src all
/usr/bin/gnumake -C port all
gnumake[2]: Nothing to be done for `all'.
/usr/bin/gnumake -C timezone all
/usr/bin/gnumake -C ../../src/port all
gnumake[3]: Nothing to be done for `all'.
/usr/bin/gnumake -C backend all
/usr/bin/gnumake -C ../../src/port all
/usr/bin/gnumake -C access all
/usr/bin/gnumake -C bootstrap all
/usr/bin/gnumake -C catalog all
gnumake[3]: Nothing to be done for `all'.
/usr/bin/gnumake -C parser all
gnumake[3]: Nothing to be done for `all'.
/usr/bin/gnumake -C common all
/usr/bin/gnumake -C gist all
gnumake[3]: Nothing to be done for `all'.
/usr/bin/gnumake -C commands all
gnumake[4]: Nothing to be done for `all'.
gnumake[4]: Nothing to be done for `all'.
/usr/bin/gnumake -C hash all
/usr/bin/gnumake -C executor all
gnumake[3]: Nothing to be done for `all'.
/usr/bin/gnumake -C foreign all
gnumake[3]: Nothing to be done for `all'.
gnumake[4]: Nothing to be done for `all'.
/usr/bin/gnumake -C lib all
/usr/bin/gnumake -C heap all
gnumake[3]: Nothing to be done for `all'.
/usr/bin/gnumake -C libpq all
gnumake[3]: Nothing to be done for `all'.
/usr/bin/gnumake -C main all
gnumake[3]: Nothing to be done for `all'.
gnumake[4]: Nothing to be done for `all'.
/usr/bin/gnumake -C nodes all
/usr/bin/gnumake -C index all
gnumake[3]: Nothing to be done for `all'.
/usr/bin/gnumake -C optimizer all
gnumake[3]: Nothing to be done for `all'.
/usr/bin/gnumake -C port all
gnumake[4]: Nothing to be done for `all'.
/usr/bin/gnumake -C nbtree all
/usr/bin/gnumake -C geqo all
gnumake[3]: Nothing to be done for `all'.
/usr/bin/gnumake -C postmaster all
/usr/bin/gnumake -C darwin all
gnumake[4]: Nothing to be done for `all'.
/usr/bin/gnumake -C transam all
gnumake[3]: Nothing to be done for `all'.
gnumake[4]: Nothing to be done for `all'.
/usr/bin/gnumake -C regex all
/usr/bin/gnumake -C path all
gnumake[4]: Nothing to be done for `all'.
/usr/bin/gnumake -C rewrite all
gnumake[4]: Nothing to be done for `all'.
/usr/bin/gnumake -C gin all
gnumake[4]: Nothing to be done for `all'.
gnumake[3]: Nothing to be done for `all'.
/usr/bin/gnumake -C storage all
/usr/bin/gnumake -C plan all
gnumake[3]: Nothing to be done for `all'.
gnumake[4]: Nothing to be done for `all'.
/usr/bin/gnumake -C tcop all
/usr/bin/gnumake -C tsearch all
gnumake[4]: Nothing to be done for `all'.
/usr/bin/gnumake -C prep all
/usr/bin/gnumake -C buffer all
gnumake[3]: Nothing to be done for `all'.
/usr/bin/gnumake -C utils all
gnumake[3]: Nothing to be done for `all'.
gnumake[4]: Nothing to be done for `all'.
/usr/bin/gnumake -C ../../src/timezone all
/usr/bin/gnumake -C util all
gnumake[4]: Nothing to be done for `all'.
/usr/bin/gnumake -C adt all
/usr/bin/gnumake -C file all
/usr/bin/gnumake -C ../../src/port all
gnumake[4]: Nothing to be done for `all'.
/usr/bin/gnumake -C cache all
gnumake[4]: Nothing to be done for `all'.
/usr/bin/gnumake -C freespace all
gnumake[4]: Nothing to be done for `all'.
/usr/bin/gnumake -C error all
gnumake[4]: Nothing to be done for `all'.
gnumake[4]: Nothing to be done for `all'.
/usr/bin/gnumake -C fmgr all
gnumake[4]: Nothing to be done for `all'.
/usr/bin/gnumake -C ipc all
/usr/bin/gnumake -C hash all
gnumake[4]: Nothing to be done for `all'.
/usr/bin/gnumake -C init all
gnumake[4]: Nothing to be done for `all'.
/usr/bin/gnumake -C large_object all
gnumake[4]: Nothing to be done for `all'.
/usr/bin/gnumake -C mb all
gnumake[4]: Nothing to be done for `all'.
/usr/bin/gnumake -C misc all
gnumake[4]: Nothing to be done for `all'.
/usr/bin/gnumake -C mmgr all
gnumake[4]: Nothing to be done for `all'.
gnumake[4]: Nothing to be done for `all'.
/usr/bin/gnumake -C lmgr all
/usr/bin/gnumake -C resowner all
gnumake[4]: Nothing to be done for `all'.
/usr/bin/gnumake -C sort all
gnumake[4]: Nothing to be done for `all'.
/usr/bin/gnumake -C time all
gnumake[4]: Nothing to be done for `all'.
/usr/bin/gnumake -C page all
gnumake[4]: Nothing to be done for `all'.
gnumake[4]: Nothing to be done for `all'.
/usr/bin/gnumake -C smgr all
gnumake[4]: Nothing to be done for `all'.
gnumake[4]: Nothing to be done for `all'.
gnumake[4]: Nothing to be done for `all'.
/usr/bin/gnumake -C backend/utils/mb/conversion_procs all
gnumake[3]: Nothing to be done for `all'.
gnumake[3]: Nothing to be done for `all'.
gnumake[3]: Nothing to be done for `all'.
gnumake[3]: Nothing to be done for `all'.
gnumake[3]: Nothing to be done for `all'.
gnumake[3]: Nothing to be done for `all'.
gnumake[3]: Nothing to be done for `all'.
gnumake[3]: Nothing to be done for `all'.
gnumake[3]: Nothing to be done for `all'.
gnumake[3]: Nothing to be done for `all'.
gnumake[3]: Nothing to be done for `all'.
gnumake[3]: Nothing to be done for `all'.
gnumake[3]: Nothing to be done for `all'.
gnumake[3]: Nothing to be done for `all'.
gnumake[3]: Nothing to be done for `all'.
gnumake[3]: Nothing to be done for `all'.
gnumake[3]: Nothing to be done for `all'.
gnumake[3]: Nothing to be done for `all'.
gnumake[3]: Nothing to be done for `all'.
gnumake[3]: Nothing to be done for `all'.
gnumake[3]: Nothing to be done for `all'.
gnumake[3]: Nothing to be done for `all'.
gnumake[3]: Nothing to be done for `all'.
gnumake[3]: Nothing to be done for `all'.
gnumake[3]: Nothing to be done for `all'.
gnumake[3]: Nothing to be done for `all'.
/usr/bin/gnumake -C backend/snowball all
gnumake[2]: Nothing to be done for `all'.
/usr/bin/gnumake -C include all
gnumake[2]: Nothing to be done for `all'.
/usr/bin/gnumake -C interfaces all
gnumake[3]: Nothing to be done for `all'.
/usr/bin/gnumake -C include all
gnumake[4]: Nothing to be done for `all'.
/usr/bin/gnumake -C pgtypeslib all
gnumake[4]: Nothing to be done for `all'.
/usr/bin/gnumake -C ecpglib all
/usr/bin/gnumake -C ../../../../src/interfaces/libpq all
/usr/bin/gnumake -C ../../../../src/interfaces/ecpg/pgtypeslib all
gnumake[5]: Nothing to be done for `all'.
gnumake[5]: Nothing to be done for `all'.
/usr/bin/gnumake -C compatlib all
gnumake[4]: Nothing to be done for `all'.
/usr/bin/gnumake -C preproc all
/usr/bin/gnumake -C ../../../../src/port all
/usr/bin/gcc-4.2 -no-cpp-precomp -O2 -arch x86_64 -Wall -Wmissing-prototypes -Wpointer-arith -Wdeclaration-after-statement -Wendif-labels -fno-strict-aliasing -fwrapv -Kthread -kthread -pthread -pthreads  -D_REENTRANT -D_THREAD_SAFE -D_POSIX_PTHREAD_SEMANTICS -DECPG_COMPILE -I../include -I../../../../src/interfaces/ecpg/include -I. -DMAJOR_VERSION=4 -DMINOR_VERSION=5 -DPATCHLEVEL=0 -I../../../../src/include -I/opt/local/include -I/opt/local/include/ossp -I/opt/local/include/libxml2  -I/opt/local/include  -c -o preproc.o preproc.c
gnumake[5]: Nothing to be done for `all'.
In file included from preproc.y:11945:
pgc.c:161: error: conflicting types for 'yyleng'
extern.h:43: error: previous declaration of 'yyleng' was here
pgc.c:288: error: conflicting types for 'yyleng'
extern.h:43: error: previous declaration of 'yyleng' was here
gnumake[4]: *** [preproc.o] Error 1
gnumake[3]: *** [all] Error 2
gnumake[2]: *** [all] Error 2
gnumake[1]: *** [all] Error 2
gnumake: *** [all] Error 2
Error: Target org.macports.build returned: shell command " cd "/opt/local/var/macports/build/_opt_local_var_macports_sources_rsync.macports.org_release_ports_databases_postgresql-devel/work/pgsql" && /usr/bin/gnumake -j4 " returned error 2
DEBUG: Backtrace: shell command " cd "/opt/local/var/macports/build/_opt_local_var_macports_sources_rsync.macports.org_release_ports_databases_postgresql-devel/work/pgsql" && /usr/bin/gnumake -j4 " returned error 2
    while executing
"command_exec build"
    (procedure "portbuild::build_main" line 9)
    invoked from within
"$procedure $targetname"
Warning: the following items did not execute (for postgresql-devel): org.macports.activate org.macports.build org.macports.destroot org.macports.install
Error: Status 1 encountered during processing.

Change History (2)

comment:1 Changed 11 years ago by jmroot (Joshua Root)

Description: modified (diff)
Owner: changed from macports-tickets@… to chepra@…
Port: postgresql-devel added

Please remember to preview and use WikiFormatting (or better, use an attachment for lengthy output), fill in the Port field, and cc the maintainer.

comment:2 Changed 10 years ago by ryandesign (Ryan Schmidt)

Resolution: duplicate
Status: newclosed

Duplicate of #21076.

Note: See TracTickets for help on using tickets.