Opened 10 years ago

Closed 9 years ago

#24790 closed defect (fixed)

Vigor 0.016_0 build error, missing sys/stropts.h

Reported by: xpru017@… Owned by: macports-tickets@…
Priority: Normal Milestone:
Component: ports Version: 1.8.2
Keywords: Cc:
Port: vigor

Description (last modified by jmroot (Joshua Root))

port install vigor
Port command started with PID 1127
--->  Computing dependencies for vigor
--->  Fetching vigor
--->  Attempting to fetch vigor-0.016.tar.gz from http://lil.fr.distfiles.macports.org/vigor
--->  Verifying checksum(s) for vigor
--->  Extracting vigor
--->  Applying patches to vigor
--->  Configuring vigor
--->  Building vigor
Error: Target org.macports.build returned: shell command " cd "/opt/local/var/macports/build/_opt_local_var_macports_sources_rsync.macports.org_release_ports_editors_vigor/work/vigor-0.016/build" && /usr/bin/make -j2 all " returned error 2
Command output: /usr/bin/gcc-4.0 -c -O -I. -I./../include -I/opt/local/include/ -I/opt/local/include -O2 -arch i386 ../ex/ex_screen.c
/usr/bin/gcc-4.0 -c -O -I. -I./../include -I/opt/local/include/ -I/opt/local/include -O2 -arch i386 ../ex/ex_script.c
../ex/ex_script.c:
27:25: error: sys/stropts.h: No such file or directory
/usr/bin/gcc-4.0 -c -O -I. -I./../include -I/opt/local/include/ -I/opt/local/include -O2 -arch i386 ../ex/ex_set.c
In file included from ../ex/../common/options.h:101,
                 from ../ex/../common/common.h:82,
                 from ../ex/ex_script.c:43:
./../include/options_def.h:11:1: warning: "O_DIRECTORY" redefined
In file included from /usr/include/fcntl.h:23,
                 from ../ex/ex_script.c:34:
/usr/include/sys/fcntl.h:149:1: warning: this is the location of the previous definition
../ex/ex_script.c: In function 'sscr_getprompt':
../ex/ex_script.c:257: warning: pointer targets in passing argument 4 of 'db_append' differ in signedness
../ex/ex_script.c:287: warning: pointer targets in passing argument 4 of 'db_append' differ in signedness
../ex/ex_script.c:292: warning: pointer targets in passing argument 2 of 'sscr_setprompt' differ in signedness
/usr/bin/gcc-4.0 -c -O -I. -I./../include -I/opt/local/include/ -I/opt/local/include -O2 -arch i386 ../ex/ex_shell.c
../ex/ex_script.c: In function 'sscr_insert':
../ex/ex_script.c:441: warning: pointer targets in assignment differ in signedness
../ex/ex_script.c:460: warning: pointer targets in assignment differ in signedness
../ex/ex_script.c:464: warning: pointer targets in passing argument 4 of 'db_append' differ in signedness
../ex/ex_script.c:478: warning: pointer targets in passing argument 2 of 'sscr_matchprompt' differ in signedness
../ex/ex_script.c:486: warning: pointer targets in assignment differ in signedness
../ex/ex_script.c:490: warning: pointer targets in passing argument 2 of 'sscr_setprompt' differ in signedness
../ex/ex_script.c:492: warning: pointer targets in passing argument 4 of 'db_append' differ in signedness
../ex/ex_script.c: In function 'ptys_open':
../ex/ex_script.c:721: error: 'I_PUSH' undeclared (first use in this function)
../ex/ex_script.c:721: error: (Each undeclared identifier is reported only once
../ex/ex_script.c:721: error: for each function it appears in.)
make: *** [ex_script.o] Error 1
make: *** Waiting for unfinished jobs....
Error: Status 1 encountered during processing.
Before reporting a bug, first run the command again with the -d flag to get complete output.
--->  Executing: /opt/local/bin/port install vigor

Change History (3)

comment:1 Changed 10 years ago by jmroot (Joshua Root)

Cc: xpru017@… removed
Description: modified (diff)
Port: 0.016_0 removed
Summary: Vigor 0.016_0 install error TargetVigor 0.016_0 build error, missing sys/stropts.h

Please remember to preview and use WikiFormatting, and note you do not need to be in cc when you are the reporter.

comment:2 Changed 10 years ago by ryandesign (Ryan Schmidt)

This software is ancient; the last version was released in 2002 so I guess it's been abandoned by its developers. If anybody knows how to make it compile, feel free to help fix the port, otherwise we may just have to delete it.

comment:3 Changed 9 years ago by jmroot (Joshua Root)

Resolution: fixed
Status: newclosed
Note: See TracTickets for help on using tickets.