Opened 10 years ago

Closed 9 years ago

#27451 closed defect (fixed)

caml-core @0.6.0 build error

Reported by: josh@… Owned by: mww@…
Priority: Normal Milestone:
Component: ports Version: 1.9.2
Keywords: Cc:
Port: caml-core

Description

Using Xcode 3.14, OS X 10.5.8, Intel MacBook:

$ sudo port install caml-core@0.6.0
--->  Computing dependencies for caml-core
--->  Building caml-core
Error: Target org.macports.build returned: shell command failed (see log for details)
Log for caml-core is at: /opt/local/var/macports/logs/_opt_local_var_macports_sources_rsync.macports.org_release_ports_devel_caml-core/main.log
Error: Status 1 encountered during processing.

The log file says:

:info:build File "ghost-location", line 21, characters 10--528::info:build Error: Unbound value Conv.add_exn_converter
:info:build make[2]: *** [exn.cmo] Error 2
:info:build make[1]: *** [byte-code-library] Error 2
:info:build make: *** [all] Error 2
:info:build shell command " cd "/opt/local/var/macports/build/_opt_local_var_mac
ports_sources_rsync.macports.org_release_ports_devel_caml-core/work/core-0.6.0" 
&& /usr/bin/make all " returned error 2

Change History (3)

comment:1 Changed 10 years ago by mf2k (Frank Schima)

Owner: changed from macports-tickets@… to mww@…

comment:2 in reply to:  description Changed 10 years ago by josh@…

I'm seeing this error with ocaml @3.12.0_0

comment:3 Changed 9 years ago by jmroot (Joshua Root)

Resolution: fixed
Status: newclosed
Note: See TracTickets for help on using tickets.