Opened 10 years ago

Closed 10 years ago

#28563 closed defect (invalid)

ivy-c @r3459 patch failed for ivy-c

Reported by: agreee45@… Owned by: macports-tickets@…
Priority: Normal Milestone:
Component: ports Version: 1.9.2
Keywords: Cc:
Port: ivy-c

Description (last modified by jmroot (Joshua Root))

:debug:main Executing org.macports.main (ivy-c)
:debug:main Skipping completed org.macports.fetch (ivy-c)
:debug:main Skipping completed org.macports.checksum (ivy-c)
:debug:main Skipping completed org.macports.extract (ivy-c)
:debug:patch patch phase started at Sun Feb 27 16:49:08 EST 2011
:debug:patch Executing org.macports.patch (ivy-c)
:msg:patch --->  Applying patches to ivy-c
:info:patch --->  Applying /opt/local/var/macports/sources/rsync.paparazziuav.org/macports/ports/devel/ivy-c/files/patch-src-Makefile.osx.diff
:debug:patch Environment: CPATH='/opt/local/include' CC_PRINT_OPTIONS_FILE='/opt/local/var/macports/build/_opt_local_var_macports_sources_rsync.paparazziuav.org_macports_ports_devel_ivy-c/work/.CC_PRINT_OPTIONS' LIBRARY_PATH='/opt/local/lib' CC_PRINT_OPTIONS='YES' MACOSX_DEPLOYMENT_TARGET='10.6'
:debug:patch Assembled command: 'cd "/opt/local/var/macports/build/_opt_local_var_macports_sources_rsync.paparazziuav.org_macports_ports_devel_ivy-c/work/ivy-c-r3459" && /usr/bin/patch -p0'
:info:patch patching file src/Makefile.osx
:info:patch Hunk #1 FAILED at 90.
:info:patch Hunk #2 FAILED at 111.
:info:patch 2 out of 2 hunks FAILED -- saving rejects to file src/Makefile.osx.rej
:info:patch shell command " cd "/opt/local/var/macports/build/_opt_local_var_macports_sources_rsync.paparazziuav.org_macports_ports_devel_ivy-c/work/ivy-c-r3459" && /usr/bin/patch -p0 < '/opt/local/var/macports/sources/rsync.paparazziuav.org/macports/ports/devel/ivy-c/files/patch-src-Makefile.osx.diff'" returned error 1
:error:patch Target org.macports.patch returned: shell command failed (see log for details)
:debug:patch Backtrace: shell command failed (see log for details)
    while executing
"command_exec patch "" "< '$patch'""
    (procedure "portpatch::patch_main" line 35)
    invoked from within
"$procedure $targetname"
:info:patch Warning: the following items did not execute (for ivy-c): org.macports.activate org.macports.patch org.macports.configure org.macports.build org.macports.destroot org.macports.install
:notice:patch Log for ivy-c is at: /opt/local/var/macports/logs/_opt_local_var_macports_sources_rsync.paparazziuav.org_macports_ports_devel_ivy-c/main.log

Attachments (1)

main.log (13.5 KB) - added by agreee45@… 10 years ago.

Download all attachments as: .zip

Change History (3)

Changed 10 years ago by agreee45@…

Attachment: main.log added

comment:1 Changed 10 years ago by agreee45@…

Sorry, I did not realize it would upload the unformatted text when I wanted to upload the files first. I am using a Macbook pro 2010 version. 10.6.6 In an attempt to install ivy-c, I encountered this problem.

comment:2 Changed 10 years ago by jmroot (Joshua Root)

Description: modified (diff)
Keywords: ivy-c org.macports.patch removed
Resolution: invalid
Status: newclosed

There doesn't appear to be an ivy-c port in our tree. You should report this to whoever wrote this portfile.

Note: See TracTickets for help on using tickets.