Opened 7 years ago

Closed 7 years ago

#30185 closed update (fixed)

gource: update to 0.35

Reported by: s9daallw@… Owned by: ryandesign (Ryan Schmidt)
Priority: Normal Milestone:
Component: ports Version:
Keywords: haspatch Cc: phw@…, s.veer@…
Port: gource

Description

currently 0.35

Attachments (1)

gource.patch (1.0 KB) - added by s9daallw@… 7 years ago.

Download all attachments as: .zip

Change History (5)

Changed 7 years ago by s9daallw@…

Attachment: gource.patch added

comment:1 Changed 7 years ago by ryandesign (Ryan Schmidt)

Keywords: haspatch added
Owner: changed from macports-tickets@… to ryandesign@…
Status: newassigned
Summary: gource updategource: update to 0.35

Thanks.

comment:2 Changed 7 years ago by ryandesign (Ryan Schmidt)

Resolution: fixed
Status: assignedclosed

comment:3 Changed 7 years ago by s.veer@…

Resolution: fixed
Status: closedreopened

Gource 0.35 build error please update to 0.37

$ sudo port search gource
gource @0.35 (devel)
    Version Control Visualization Tool
sanders-imac:~ sveer$ sudo port install gource
--->  Computing dependencies for gource
--->  Dependencies to be installed: ftgl gsed glew libsdl xorg-libXrandr xorg-randrproto libsdl_image tiff
--->  Fetching archive for gsed
--->  Attempting to fetch gsed-4.2.1_2.darwin_11.x86_64.tbz2 from http://packages.macports.org/gsed
--->  Fetching gsed
--->  Attempting to fetch sed-4.2.1.tar.gz from http://lil.fr.distfiles.macports.org/gsed
--->  Verifying checksum(s) for gsed
--->  Extracting gsed
--->  Configuring gsed
--->  Building gsed
--->  Staging gsed into destroot
--->  Installing gsed @4.2.1_2
--->  Activating gsed @4.2.1_2
--->  Cleaning gsed
--->  Fetching archive for ftgl
--->  Attempting to fetch ftgl-2.1.3-rc5_0.darwin_11.x86_64.tbz2 from http://packages.macports.org/ftgl
--->  Fetching ftgl
--->  Attempting to fetch ftgl-2.1.3-rc5.tar.gz from http://voxel.dl.sourceforge.net/ftgl
--->  Verifying checksum(s) for ftgl
--->  Extracting ftgl
--->  Applying patches to ftgl
--->  Configuring ftgl
--->  Building ftgl
--->  Staging ftgl into destroot
--->  Installing ftgl @2.1.3-rc5_0
--->  Activating ftgl @2.1.3-rc5_0
--->  Cleaning ftgl
--->  Fetching archive for glew
--->  Attempting to fetch glew-1.7.0_0.darwin_11.x86_64.tbz2 from http://packages.macports.org/glew
--->  Fetching glew
--->  Attempting to fetch glew-1.7.0.tgz from http://voxel.dl.sourceforge.net/project/glew/glew/1.7.0/
--->  Verifying checksum(s) for glew
--->  Extracting glew
--->  Applying patches to glew
--->  Configuring glew
--->  Building glew
--->  Staging glew into destroot
--->  Installing glew @1.7.0_0
--->  Activating glew @1.7.0_0
--->  Cleaning glew
--->  Fetching archive for xorg-randrproto
--->  Attempting to fetch xorg-randrproto-1.3.2_0.darwin_11.noarch.tbz2 from http://packages.macports.org/xorg-randrproto
--->  Fetching xorg-randrproto
--->  Attempting to fetch randrproto-1.3.2.tar.bz2 from http://lil.fr.distfiles.macports.org/xorg-randrproto
--->  Verifying checksum(s) for xorg-randrproto
--->  Extracting xorg-randrproto
--->  Configuring xorg-randrproto
--->  Building xorg-randrproto
--->  Staging xorg-randrproto into destroot
--->  Installing xorg-randrproto @1.3.2_0
--->  Activating xorg-randrproto @1.3.2_0
--->  Cleaning xorg-randrproto
--->  Fetching archive for xorg-libXrandr
--->  Attempting to fetch xorg-libXrandr-1.3.2_0.darwin_11.x86_64.tbz2 from http://packages.macports.org/xorg-libXrandr
--->  Fetching xorg-libXrandr
--->  Attempting to fetch libXrandr-1.3.2.tar.bz2 from http://lil.fr.distfiles.macports.org/xorg-libXrandr
--->  Verifying checksum(s) for xorg-libXrandr
--->  Extracting xorg-libXrandr
--->  Configuring xorg-libXrandr
--->  Building xorg-libXrandr
--->  Staging xorg-libXrandr into destroot
--->  Installing xorg-libXrandr @1.3.2_0
--->  Activating xorg-libXrandr @1.3.2_0
--->  Cleaning xorg-libXrandr
--->  Fetching archive for libsdl
--->  Attempting to fetch libsdl-1.2.14_9+x11.darwin_11.x86_64.tbz2 from http://packages.macports.org/libsdl
--->  Fetching libsdl
--->  Attempting to fetch SDL-1.2.14.tar.gz from http://lil.fr.distfiles.macports.org/libsdl/1.2.14_8
--->  Verifying checksum(s) for libsdl
--->  Extracting libsdl
--->  Applying patches to libsdl
--->  Configuring libsdl
--->  Building libsdl
--->  Staging libsdl into destroot
--->  Installing libsdl @1.2.14_9+x11
--->  Activating libsdl @1.2.14_9+x11
--->  Cleaning libsdl
--->  Fetching archive for tiff
--->  Attempting to fetch tiff-3.9.5_0.darwin_11.x86_64.tbz2 from http://packages.macports.org/tiff
--->  Fetching tiff
--->  Attempting to fetch tiff-3.9.5.tar.gz from http://lil.fr.distfiles.macports.org/tiff
--->  Verifying checksum(s) for tiff
--->  Extracting tiff
--->  Configuring tiff
--->  Building tiff
--->  Staging tiff into destroot
--->  Installing tiff @3.9.5_0
--->  Activating tiff @3.9.5_0
--->  Cleaning tiff
--->  Fetching archive for libsdl_image
--->  Attempting to fetch libsdl_image-1.2.10_3.darwin_11.x86_64.tbz2 from http://packages.macports.org/libsdl_image
--->  Fetching libsdl_image
--->  Attempting to fetch SDL_image-1.2.10.tar.gz from http://lil.fr.distfiles.macports.org/libsdl_image
--->  Verifying checksum(s) for libsdl_image
--->  Extracting libsdl_image
--->  Configuring libsdl_image
--->  Building libsdl_image
--->  Staging libsdl_image into destroot
--->  Installing libsdl_image @1.2.10_3
--->  Activating libsdl_image @1.2.10_3
--->  Cleaning libsdl_image
--->  Fetching archive for gource
--->  Attempting to fetch gource-0.35_1.darwin_11.x86_64.tbz2 from http://packages.macports.org/gource
--->  Fetching gource
--->  Attempting to fetch gource-0.35.tar.gz from http://gource.googlecode.com/files/
--->  Verifying checksum(s) for gource
--->  Extracting gource
--->  Configuring gource
--->  Building gource
Error: Target org.macports.build returned: shell command failed (see log for details)
Log for gource is at: /opt/local/var/macports/logs/_opt_local_var_macports_sources_rsync.macports.org_release_tarballs_ports_devel_gource/gource/main.log
Error: Status 1 encountered during processing.
To report a bug, see <http://guide.macports.org/#project.tickets>

$vi /opt/local/var/macports/logs/_opt_local_var_macports_sources_rsync.macports.org_release_tarballs_ports_devel_gource/gource/main.log

:info:build     mv -f $depbase.Tpo $depbase.Po
:info:build depbase=`echo src/core/conffile.o | sed 's|[^/]*$|.deps/&|;s|\.o$||'`;\
:info:build     /Developer/usr/bin/clang++ -DPACKAGE_NAME=\"Gource\" -DPACKAGE_TARNAME=\"gource\" -DPACKAGE_VERSION=\"0.35\" -DPACKAGE_STRING=\"Gource\ 0.35\" -DPACKAGE_BUGREPORT=\"acaudwell@gmail.com\" -DPACKAGE_URL=\"\" -DPACKAGE=\"gource\" -DVERSION=\"0.35\" -DHAVE_PTHREAD=1 -DSTDC_HEADERS=1 -DHAVE_SYS_TYPES_H=1 -DHAVE_SYS_STAT_H=1 -DHAVE_STDLIB_H=1 -DHAVE_STRING_H=1 -DHAVE_MEMORY_H=1 -DHAVE_STRINGS_H=1 -DHAVE_INTTYPES_H=1 -DHAVE_STDINT_H=1 -DHAVE_UNISTD_H=1 -DHAVE_OPENGL_GL_H=1 -DHAVE_OPENGL_GLU_H=1 -DHAVE_LIBPCRE=1 -I.   -DSDLAPP_RESOURCE_DIR=\"/opt/local/share/gource\"   -pipe -O2 -arch x86_64 -D_THREAD_SAFE  -D_THREAD_SAFE  -I/opt/local/include/SDL -D_GNU_SOURCE=1 -D_THREAD_SAFE -I/opt/local/include/freetype2 -I/opt/local/include -MT src/core/conffile.o -MD -MP -MF $depbase.Tpo -c -o src/core/conffile.o src/core/conffile.cpp &&\
:info:build     mv -f $depbase.Tpo $depbase.Po
:info:build depbase=`echo src/core/display.o | sed 's|[^/]*$|.deps/&|;s|\.o$||'`;\
:info:build     /Developer/usr/bin/clang++ -DPACKAGE_NAME=\"Gource\" -DPACKAGE_TARNAME=\"gource\" -DPACKAGE_VERSION=\"0.35\" -DPACKAGE_STRING=\"Gource\ 0.35\" -DPACKAGE_BUGREPORT=\"acaudwell@gmail.com\" -DPACKAGE_URL=\"\" -DPACKAGE=\"gource\" -DVERSION=\"0.35\" -DHAVE_PTHREAD=1 -DSTDC_HEADERS=1 -DHAVE_SYS_TYPES_H=1 -DHAVE_SYS_STAT_H=1 -DHAVE_STDLIB_H=1 -DHAVE_STRING_H=1 -DHAVE_MEMORY_H=1 -DHAVE_STRINGS_H=1 -DHAVE_INTTYPES_H=1 -DHAVE_STDINT_H=1 -DHAVE_UNISTD_H=1 -DHAVE_OPENGL_GL_H=1 -DHAVE_OPENGL_GLU_H=1 -DHAVE_LIBPCRE=1 -I.   -DSDLAPP_RESOURCE_DIR=\"/opt/local/share/gource\"   -pipe -O2 -arch x86_64 -D_THREAD_SAFE  -D_THREAD_SAFE  -I/opt/local/include/SDL -D_GNU_SOURCE=1 -D_THREAD_SAFE -I/opt/local/include/freetype2 -I/opt/local/include -MT src/core/display.o -MD -MP -MF $depbase.Tpo -c -o src/core/display.o src/core/display.cpp &&\
:info:build     mv -f $depbase.Tpo $depbase.Po
:info:build In file included from src/commitlog.cpp:18:
:info:build In file included from src/commitlog.h:26:
:info:build In file included from src/core/utf8/utf8.h:31:
:info:build src/core/utf8/checked.h:82:21: error: call to function 'append' that is neither visible in the template definition nor found by argument-dependent lookup
:info:build                     append (replacement, out);
:info:build                     ^
:info:build src/commitlog.cpp:24:9: note: in instantiation of function template specialization 'utf8::replace_invalid<__gnu_cxx::__normal_iterator<const char *, std::basic_string<char> >, std::back_insert_iterator<std::basic_string<char> > >' requested here
:info:build         utf8::replace_invalid(str.begin(), str.end(), back_inserter(munged), '?');
:info:build         ^
:info:build src/core/utf8/checked.h:107:20: note: 'append' should be declared prior to the call site or in namespace '__gnu_cxx'
:info:build     octet_iterator append(uint32_t cp, octet_iterator result)
:info:build                    ^
:info:build src/core/utf8/checked.h:88:21: error: call to function 'append' that is neither visible in the template definition nor found by argument-dependent lookup
:info:build                     append (replacement, out);
:info:build                     ^
:info:build src/core/utf8/checked.h:107:20: note: 'append' should be declared prior to the call site or in namespace '__gnu_cxx'
:info:build     octet_iterator append(uint32_t cp, octet_iterator result)
:info:build                    ^
:info:build 2 errors generated.
:info:build make: *** [src/commitlog.o] Error 1
:info:build make: *** Waiting for unfinished jobs....
:info:build src/core/camera.cpp:235:39: warning: '&&' within '||' [-Wlogical-op-parentheses]
:info:build     if(finished || events.size() == 0 && current==0) return;
:info:build                 ~~ ~~~~~~~~~~~~~~~~~~~^~~~~~~~~~~~~
:info:build src/core/camera.cpp:235:39: note: place parentheses around the '&&' expression to silence this warning
:info:build     if(finished || events.size() == 0 && current==0) return;
:info:build                                       ^
:info:build                    (                               )
:info:build 1 warning generated.
:info:build make: Leaving directory `/opt/local/var/macports/build/_opt_local_var_macports_sources_rsync.macports.org_release_tarballs_ports_devel_gource/gource/work/gource-0.35'
:info:build shell command " cd "/opt/local/var/macports/build/_opt_local_var_macports_sources_rsync.macports.org_release_tarballs_ports_devel_gource/gource/work/gource-0.35" && /usr/bin/make -j4 -w all " returned error 2
:error:build Target org.macports.build returned: shell command failed (see log for details)
:debug:build Backtrace: shell command failed (see log for details)
    while executing
"command_exec build"
    (procedure "portbuild::build_main" line 8)
    invoked from within
"$procedure $targetname"
:info:build Warning: the following items did not execute (for gource): org.macports.activate org.macports.build org.macports.destroot org.macports.install
:notice:build Log for gource is at: /opt/local/var/macports/logs/_opt_local_var_macports_sources_rsync.macports.org_release_tarballs_ports_devel_gource/gource/main.log

comment:4 Changed 7 years ago by ryandesign (Ryan Schmidt)

Cc: s.veer@… added
Resolution: fixed
Status: reopenedclosed

This ticket was about updating gource to 0.35. That was accomplished in r80519 and this ticket is therefore closed. To request an update to the port, please file a new ticket.

Note: See TracTickets for help on using tickets.